BDBM50273864 CHEMBL511352::tert-Butyl-4-[1-(2-methylphenyl)-1H-1,2,3-triazol-4-yl]-3,6-dihydropyridine-1(2H)-carboxylate
SMILES: Cc1ccccc1-n1cc(nn1)C1=CCN(CC1)C(=O)OC(C)(C)C
InChI Key: InChIKey=JMIBSVABGHKOBI-UHFFFAOYSA-N
Data: 3 IC50
Activity Spreadsheet -- Enzyme Inhibition Constant Data from BindingDB
Found 3 hits for monomerid = 50273864
Trg + Lig
Ki
nM
ΔG°
kcal/mole
IC50
nM
Kd
nM
EC50/IC50
nM
koff
s-1
kon
M-1s-1
pHTemp
°C
Metabotropic glutamate receptor 1
(Homo sapiens (Human))
BDBM50273864
(CHEMBL511352 | tert-Butyl-4-[1-(2-methylphenyl)-1H...)
Show SMILES Cc1ccccc1-n1cc(nn1)C1=CCN(CC1)C(=O)OC(C)(C)C |t:14|
Show InChI InChI=1S/C19H24N4O2/c1-14-7-5-6-8-17(14)23-13-16(20-21-23)15-9-11-22(12-10-15)18(24)25-19(2,3)4/h5-9,13H,10-12H2,1-4H3
n/an/a 11n/an/an/an/an/an/a
Tsukuba Research Institute
Curated by ChEMBL
Assay Description
Antagonist activity at human mGluR1 expressed in CHO cells assessed as calcium flux by FLIPR assay
Bioorg Med Chem 16: 9817-29 (2008)
Article DOI: 10.1016/j.bmc.2008.09.060
BindingDB Entry DOI: 10.7270/Q2QN66K2
Metabotropic glutamate receptor 5
(Homo sapiens (Human))
BDBM50273864
(CHEMBL511352 | tert-Butyl-4-[1-(2-methylphenyl)-1H...)
Show SMILES Cc1ccccc1-n1cc(nn1)C1=CCN(CC1)C(=O)OC(C)(C)C |t:14|
Show InChI InChI=1S/C19H24N4O2/c1-14-7-5-6-8-17(14)23-13-16(20-21-23)15-9-11-22(12-10-15)18(24)25-19(2,3)4/h5-9,13H,10-12H2,1-4H3
n/an/a 880n/an/an/an/an/an/a
Tsukuba Research Institute
Curated by ChEMBL
Assay Description
Antagonist activity at human mGluR5 expressed in CHO cells assessed as calcium flux by FLIPR assay
Bioorg Med Chem 16: 9817-29 (2008)
Article DOI: 10.1016/j.bmc.2008.09.060
BindingDB Entry DOI: 10.7270/Q2QN66K2
Metabotropic glutamate receptor 1
(Mus musculus)
BDBM50273864
(CHEMBL511352 | tert-Butyl-4-[1-(2-methylphenyl)-1H...)
Show SMILES Cc1ccccc1-n1cc(nn1)C1=CCN(CC1)C(=O)OC(C)(C)C |t:14|
Show InChI InChI=1S/C19H24N4O2/c1-14-7-5-6-8-17(14)23-13-16(20-21-23)15-9-11-22(12-10-15)18(24)25-19(2,3)4/h5-9,13H,10-12H2,1-4H3
Reactome pathway
n/an/a 58n/an/an/an/an/an/a
Tsukuba Research Institute
Curated by ChEMBL
Assay Description
Antagonist activity at mouse mGluR1 expressed in CHO cells assessed as calcium flux by FLIPR assay
Bioorg Med Chem 16: 9817-29 (2008)
Article DOI: 10.1016/j.bmc.2008.09.060
BindingDB Entry DOI: 10.7270/Q2QN66K2