BDBM50274175 (2E)-N-[(5R,6R)-17-(Cyclopropylmethyl)-4,5-epoxy-3,14-dihydroxymorphinan-6-yl]-3-phenyl-N-methylprop-2-enamide::CHEMBL491868
SMILES: CN([C@@H]1CC[C@@]2(O)[C@H]3Cc4ccc(O)c5O[C@@H]1[C@]2(CCN3CC1CC1)c45)C(=O)\C=C\c1ccccc1
InChI Key: InChIKey=OJZXMIJRTCOCAJ-ZLBGLQFLSA-N
Data: 1 KI  1 IC50
Activity Spreadsheet -- Enzyme Inhibition Constant Data from BindingDB
Found 2 hits for monomerid = 50274175
Trg + Lig
Ki
nM
ΔG°
kcal/mole
IC50
nM
Kd
nM
EC50/IC50
nM
koff
s-1
kon
M-1s-1
pHTemp
°C
Orexin receptor type 1
(Homo sapiens (Human))
BDBM50274175
((2E)-N-[(5R,6R)-17-(Cyclopropylmethyl)-4,5-epoxy-3...)
Show SMILES CN([C@@H]1CC[C@@]2(O)[C@H]3Cc4ccc(O)c5O[C@@H]1[C@]2(CCN3CC1CC1)c45)C(=O)\C=C\c1ccccc1 |r,TLB:4:5:9.25.8:18.20.19,THB:6:5:9.25.8:18.20.19|
Show InChI InChI=1S/C30H34N2O4/c1-31(25(34)12-9-19-5-3-2-4-6-19)22-13-14-30(35)24-17-21-10-11-23(33)27-26(21)29(30,28(22)36-27)15-16-32(24)18-20-7-8-20/h2-6,9-12,20,22,24,28,33,35H,7-8,13-18H2,1H3/b12-9+/t22-,24-,28+,29+,30-/m1/s1
Reactome pathway
389n/an/an/an/an/an/an/an/a
University of Tsukuba
Curated by ChEMBL
Assay Description
Antagonist activity at human OX1R expressed in CHOK1 cells assessed as inhibition of orexin A-induced intracellular calcium level preincubated for 15...
J Med Chem 60: 1018-1040 (2017)
BindingDB Entry DOI: 10.7270/Q22N54JH
Kappa-type opioid receptor
(Mus musculus (Mouse))
BDBM50274175
((2E)-N-[(5R,6R)-17-(Cyclopropylmethyl)-4,5-epoxy-3...)
Show SMILES CN([C@@H]1CC[C@@]2(O)[C@H]3Cc4ccc(O)c5O[C@@H]1[C@]2(CCN3CC1CC1)c45)C(=O)\C=C\c1ccccc1 |r,TLB:4:5:9.25.8:18.20.19,THB:6:5:9.25.8:18.20.19|
Show InChI InChI=1S/C30H34N2O4/c1-31(25(34)12-9-19-5-3-2-4-6-19)22-13-14-30(35)24-17-21-10-11-23(33)27-26(21)29(30,28(22)36-27)15-16-32(24)18-20-7-8-20/h2-6,9-12,20,22,24,28,33,35H,7-8,13-18H2,1H3/b12-9+/t22-,24-,28+,29+,30-/m1/s1
n/an/a 0.166n/an/an/an/an/an/a
Toray Industries, Inc.
Curated by ChEMBL
Assay Description
Agonist activity at kappa opioid receptor in ddy mouse vas deferens assessed as inhibition of electric stimulation-induced contraction
Bioorg Med Chem 16: 9188-201 (2008)
Article DOI: 10.1016/j.bmc.2008.09.011
BindingDB Entry DOI: 10.7270/Q2736RVD