BDBM50274279 CHEMBL502863::p-Methoxyphenyl (3,5,9-trideoxy-5-glycolamido-9-(2-hydroxybenzamido)-D-glycero-alpha-D-galacto-2-nonulopyranosylonic acid)-(2->6)-beta-D-galactopyranoside
SMILES: COc1ccc(O[C@@H]2O[C@H](CO[C@@]3(C[C@H](O)[C@@H](NC(=O)CO)[C@@H](O3)[C@H](O)[C@H](O)CNC(=O)c3ccccc3O)C(O)=O)[C@H](O)[C@H](O)[C@H]2O)cc1
InChI Key: InChIKey=JHALUKVWMKVZBD-MXATYJMQSA-N
Data: 1 IC50
Activity Spreadsheet -- Enzyme Inhibition Constant Data from BindingDB
Found 1 hit for monomerid = 50274279
Trg + Lig
Ki
nM
ΔG°
kcal/mole
IC50
nM
Kd
nM
EC50/IC50
nM
koff
s-1
kon
M-1s-1
pHTemp
°C
B-cell receptor CD22
(Homo sapiens (Human))
BDBM50274279
(CHEMBL502863 | p-Methoxyphenyl (3,5,9-trideoxy-5-g...)
Show SMILES COc1ccc(O[C@@H]2O[C@H](CO[C@@]3(C[C@H](O)[C@@H](NC(=O)CO)[C@@H](O3)[C@H](O)[C@H](O)CNC(=O)c3ccccc3O)C(O)=O)[C@H](O)[C@H](O)[C@H]2O)cc1 |r|
Show InChI InChI=1S/C31H40N2O17/c1-46-14-6-8-15(9-7-14)48-29-26(42)25(41)24(40)20(49-29)13-47-31(30(44)45)10-18(36)22(33-21(38)12-34)27(50-31)23(39)19(37)11-32-28(43)16-4-2-3-5-17(16)35/h2-9,18-20,22-27,29,34-37,39-42H,10-13H2,1H3,(H,32,43)(H,33,38)(H,44,45)/t18-,19+,20+,22+,23+,24-,25-,26+,27+,29+,31+/m0/s1
NCI pathway
n/an/a 1.93E+5n/an/an/an/an/an/a
Gifu University
Curated by ChEMBL
Assay Description
Binding affinity to biotinylated human CD22-human IgG1 chimeric protein expressed in mouse J558LST6 cells by flow cytometry
J Med Chem 51: 6665-81 (2008)
Article DOI: 10.1021/jm8000696
BindingDB Entry DOI: 10.7270/Q23X86GN