BDBM50274309 CHEMBL460576::p-Methoxyphenyl (3,5,9-trideoxy-5-glycolamido-9-(4'-methyl-4-biphenyl)-methylamino-D-glycero-alpha-D-galacto-2-nonulopyranosylonicacid)-(2->6)-beta-D-galactopyranoside
SMILES: COc1ccc(O[C@@H]2O[C@H](CO[C@@]3(C[C@H](O)[C@@H](NC(=O)CO)[C@@H](O3)[C@H](O)[C@H](O)CNCc3ccc(cc3)-c3ccc(C)cc3)C(O)=O)[C@H](O)[C@H](O)[C@H]2O)cc1
InChI Key: InChIKey=GJQOHKIMPYDVHO-GFAHYQBQSA-N
Data: 1 IC50
Activity Spreadsheet -- Enzyme Inhibition Constant Data from BindingDB
Found 1 hit for monomerid = 50274309
Trg + Lig
Ki
nM
ΔG°
kcal/mole
IC50
nM
Kd
nM
EC50/IC50
nM
koff
s-1
kon
M-1s-1
pHTemp
°C
CD22
(Homo sapiens (Human))
BDBM50274309
(CHEMBL460576 | p-Methoxyphenyl (3,5,9-trideoxy-5-g...)
Show SMILES COc1ccc(O[C@@H]2O[C@H](CO[C@@]3(C[C@H](O)[C@@H](NC(=O)CO)[C@@H](O3)[C@H](O)[C@H](O)CNCc3ccc(cc3)-c3ccc(C)cc3)C(O)=O)[C@H](O)[C@H](O)[C@H]2O)cc1 |r|
Show InChI InChI=1S/C38H48N2O15/c1-20-3-7-22(8-4-20)23-9-5-21(6-10-23)16-39-17-27(43)31(45)35-30(40-29(44)18-41)26(42)15-38(55-35,37(49)50)52-19-28-32(46)33(47)34(48)36(54-28)53-25-13-11-24(51-2)12-14-25/h3-14,26-28,30-36,39,41-43,45-48H,15-19H2,1-2H3,(H,40,44)(H,49,50)/t26-,27+,28+,30+,31+,32-,33-,34+,35+,36+,38+/m0/s1
NCI pathway
n/an/a 9.83E+3n/an/an/an/an/an/a
Gifu University
Curated by ChEMBL
Assay Description
Binding affinity to biotinylated human CD22-human IgG1 chimeric protein expressed in mouse J558LST6 cells by flow cytometry
J Med Chem 51: 6665-81 (2008)
Article DOI: 10.1021/jm8000696
BindingDB Entry DOI: 10.7270/Q23X86GN