BDBM50274340 CHEMBL483403::N-(1-(3-amino-3-oxopropyl)-5-(N-methylcyclohexanecarboxamido)-1H-benzo[d]imidazol-2-yl)-4-chlorobenzamide
SMILES: CN(C(=O)C1CCCCC1)c1ccc2n(CCC(N)=O)c(NC(=O)c3ccc(Cl)cc3)nc2c1
InChI Key: InChIKey=OGZCHMBOZNMDQZ-UHFFFAOYSA-N
Data: 4 IC50
Activity Spreadsheet -- Enzyme Inhibition Constant Data from BindingDB
Found 4 hits for monomerid = 50274340
Trg + Lig
Ki
nM
ΔG°
kcal/mole
IC50
nM
Kd
nM
EC50/IC50
nM
koff
s-1
kon
M-1s-1
pHTemp
°C
Insulin receptor
(Homo sapiens (Human))
BDBM50274340
(CHEMBL483403 | N-(1-(3-amino-3-oxopropyl)-5-(N-met...)
Show SMILES CN(C(=O)C1CCCCC1)c1ccc2n(CCC(N)=O)c(NC(=O)c3ccc(Cl)cc3)nc2c1
Show InChI InChI=1S/C25H28ClN5O3/c1-30(24(34)17-5-3-2-4-6-17)19-11-12-21-20(15-19)28-25(31(21)14-13-22(27)32)29-23(33)16-7-9-18(26)10-8-16/h7-12,15,17H,2-6,13-14H2,1H3,(H2,27,32)(H,28,29,33)
n/an/a 3.90E+3n/an/an/an/an/an/a
Johnson & Johnson
Curated by ChEMBL
Assay Description
Inhibition of IRK
Bioorg Med Chem Lett 18: 5545-9 (2008)
Article DOI: 10.1016/j.bmcl.2008.09.015
BindingDB Entry DOI: 10.7270/Q2M32VMD
Tyrosine-protein kinase ITK/TSK
(Homo sapiens (Human))
BDBM50274340
(CHEMBL483403 | N-(1-(3-amino-3-oxopropyl)-5-(N-met...)
Show SMILES CN(C(=O)C1CCCCC1)c1ccc2n(CCC(N)=O)c(NC(=O)c3ccc(Cl)cc3)nc2c1
Show InChI InChI=1S/C25H28ClN5O3/c1-30(24(34)17-5-3-2-4-6-17)19-11-12-21-20(15-19)28-25(31(21)14-13-22(27)32)29-23(33)16-7-9-18(26)10-8-16/h7-12,15,17H,2-6,13-14H2,1H3,(H2,27,32)(H,28,29,33)
Reactome pathway
n/an/a 320n/an/an/an/an/an/a
Johnson & Johnson
Curated by ChEMBL
Assay Description
Inhibition of human ITK expressed in chicken DT40 cells assessed as B cell receptor-stimulated calcium influx by FLIPR assay
Bioorg Med Chem Lett 18: 5545-9 (2008)
Article DOI: 10.1016/j.bmcl.2008.09.015
BindingDB Entry DOI: 10.7270/Q2M32VMD
Tyrosine-protein kinase Lyn
(Homo sapiens (Human))
BDBM50274340
(CHEMBL483403 | N-(1-(3-amino-3-oxopropyl)-5-(N-met...)
Show SMILES CN(C(=O)C1CCCCC1)c1ccc2n(CCC(N)=O)c(NC(=O)c3ccc(Cl)cc3)nc2c1
Show InChI InChI=1S/C25H28ClN5O3/c1-30(24(34)17-5-3-2-4-6-17)19-11-12-21-20(15-19)28-25(31(21)14-13-22(27)32)29-23(33)16-7-9-18(26)10-8-16/h7-12,15,17H,2-6,13-14H2,1H3,(H2,27,32)(H,28,29,33)
Reactome pathway
n/an/a>1.00E+6n/an/an/an/an/an/a
Johnson & Johnson
Curated by ChEMBL
Assay Description
Inhibition of Lyn kinase
Bioorg Med Chem Lett 18: 5545-9 (2008)
Article DOI: 10.1016/j.bmcl.2008.09.015
BindingDB Entry DOI: 10.7270/Q2M32VMD
Tyrosine-protein kinase ITK/TSK
(Homo sapiens (Human))
BDBM50274340
(CHEMBL483403 | N-(1-(3-amino-3-oxopropyl)-5-(N-met...)
Show SMILES CN(C(=O)C1CCCCC1)c1ccc2n(CCC(N)=O)c(NC(=O)c3ccc(Cl)cc3)nc2c1
Show InChI InChI=1S/C25H28ClN5O3/c1-30(24(34)17-5-3-2-4-6-17)19-11-12-21-20(15-19)28-25(31(21)14-13-22(27)32)29-23(33)16-7-9-18(26)10-8-16/h7-12,15,17H,2-6,13-14H2,1H3,(H2,27,32)(H,28,29,33)
Reactome pathway
n/an/a 4n/an/an/an/an/an/a
Johnson & Johnson
Curated by ChEMBL
Assay Description
Inhibition of ITK by DELFIA assay
Bioorg Med Chem Lett 18: 5545-9 (2008)
Article DOI: 10.1016/j.bmcl.2008.09.015
BindingDB Entry DOI: 10.7270/Q2M32VMD