BDBM50274487 3-{Cyclobutyl[3-(5-methoxy-1H-indol-3-yl)propyl]amino}-8-fluorochromane-5-carboxamide::CHEMBL484581
SMILES: COc1ccc2[nH]cc(CCCN(C3CCC3)C3COc4c(F)ccc(C(N)=O)c4C3)c2c1
InChI Key: InChIKey=WNAOOYIEDUVWJW-UHFFFAOYSA-N
Data: 2 KI  2 IC50
Activity Spreadsheet -- Enzyme Inhibition Constant Data from BindingDB
Found 4 hits for monomerid = 50274487
Trg + Lig
Ki
nM
ΔG°
kcal/mole
IC50
nM
Kd
nM
EC50/IC50
nM
koff
s-1
kon
M-1s-1
pHTemp
°C
5-hydroxytryptamine receptor 1A
(Homo sapiens (Human))
BDBM50274487
(3-{Cyclobutyl[3-(5-methoxy-1H-indol-3-yl)propyl]am...)
Show SMILES COc1ccc2[nH]cc(CCCN(C3CCC3)C3COc4c(F)ccc(C(N)=O)c4C3)c2c1
Show InChI InChI=1S/C26H30FN3O3/c1-32-19-7-10-24-21(13-19)16(14-29-24)4-3-11-30(17-5-2-6-17)18-12-22-20(26(28)31)8-9-23(27)25(22)33-15-18/h7-10,13-14,17-18,29H,2-6,11-12,15H2,1H3,(H2,28,31)
1.19n/an/an/an/an/an/an/an/a
Wyeth Research
Curated by ChEMBL
Assay Description
Displacement of [3H]8-OH-DPAT from human cloned 5HT1A receptor expressed in CHO cells
J Med Chem 51: 6980-7004 (2008)
Article DOI: 10.1021/jm8007097
BindingDB Entry DOI: 10.7270/Q2TT4RWM
Sodium-dependent serotonin transporter
(Rattus norvegicus (rat))
BDBM50274487
(3-{Cyclobutyl[3-(5-methoxy-1H-indol-3-yl)propyl]am...)
Show SMILES COc1ccc2[nH]cc(CCCN(C3CCC3)C3COc4c(F)ccc(C(N)=O)c4C3)c2c1
Show InChI InChI=1S/C26H30FN3O3/c1-32-19-7-10-24-21(13-19)16(14-29-24)4-3-11-30(17-5-2-6-17)18-12-22-20(26(28)31)8-9-23(27)25(22)33-15-18/h7-10,13-14,17-18,29H,2-6,11-12,15H2,1H3,(H2,28,31)
>1.00E+3n/an/an/an/an/an/an/an/a
Wyeth Research
Curated by ChEMBL
Assay Description
Displacement of [3H]paroxetine from serotonin transporter in Sprague-Dawley rat frontal cortical membrane
J Med Chem 51: 6980-7004 (2008)
Article DOI: 10.1021/jm8007097
BindingDB Entry DOI: 10.7270/Q2TT4RWM
Sodium-dependent serotonin transporter
(Homo sapiens (Human))
BDBM50274487
(3-{Cyclobutyl[3-(5-methoxy-1H-indol-3-yl)propyl]am...)
Show SMILES COc1ccc2[nH]cc(CCCN(C3CCC3)C3COc4c(F)ccc(C(N)=O)c4C3)c2c1
Show InChI InChI=1S/C26H30FN3O3/c1-32-19-7-10-24-21(13-19)16(14-29-24)4-3-11-30(17-5-2-6-17)18-12-22-20(26(28)31)8-9-23(27)25(22)33-15-18/h7-10,13-14,17-18,29H,2-6,11-12,15H2,1H3,(H2,28,31)
n/an/a 834n/an/an/an/an/an/a
Wyeth Research
Curated by ChEMBL
Assay Description
Inhibition of 5-HT transporter-mediated [3H]5HT uptake in human Jar cells
J Med Chem 51: 6980-7004 (2008)
Article DOI: 10.1021/jm8007097
BindingDB Entry DOI: 10.7270/Q2TT4RWM
5-hydroxytryptamine receptor 1A
(Homo sapiens (Human))
BDBM50274487
(3-{Cyclobutyl[3-(5-methoxy-1H-indol-3-yl)propyl]am...)
Show SMILES COc1ccc2[nH]cc(CCCN(C3CCC3)C3COc4c(F)ccc(C(N)=O)c4C3)c2c1
Show InChI InChI=1S/C26H30FN3O3/c1-32-19-7-10-24-21(13-19)16(14-29-24)4-3-11-30(17-5-2-6-17)18-12-22-20(26(28)31)8-9-23(27)25(22)33-15-18/h7-10,13-14,17-18,29H,2-6,11-12,15H2,1H3,(H2,28,31)
n/an/a 419n/an/an/an/an/an/a
Wyeth Research
Curated by ChEMBL
Assay Description
Activity at human cloned 5HT1A receptor expressed in CHO cells assessed as blockade of 5-HT-stimulated [35S]GTPgammaS binding
J Med Chem 51: 6980-7004 (2008)
Article DOI: 10.1021/jm8007097
BindingDB Entry DOI: 10.7270/Q2TT4RWM