BDBM50274662 4-(4-(1,2-dimethyl-1H-imidazol-5-yl)pyrimidin-2-ylamino)-N-(3-isopropoxypropyl)benzenesulfonamide::CHEMBL520353
SMILES: CC(C)OCCCNS(=O)(=O)c1ccc(Nc2nccc(n2)-c2cnc(C)n2C)cc1
InChI Key: InChIKey=YDAZSMGTKCIGJO-UHFFFAOYSA-N
Data: 1 IC50
Activity Spreadsheet -- Enzyme Inhibition Constant Data from BindingDB
Found 1 hit for monomerid = 50274662
Trg + Lig
Ki
nM
ΔG°
kcal/mole
IC50
nM
Kd
nM
EC50/IC50
nM
koff
s-1
kon
M-1s-1
pHTemp
°C
Cyclin-dependent kinase 2
(Homo sapiens (Human))
BDBM50274662
(4-(4-(1,2-dimethyl-1H-imidazol-5-yl)pyrimidin-2-yl...)
Show SMILES CC(C)OCCCNS(=O)(=O)c1ccc(Nc2nccc(n2)-c2cnc(C)n2C)cc1
Show InChI InChI=1S/C21H28N6O3S/c1-15(2)30-13-5-11-24-31(28,29)18-8-6-17(7-9-18)25-21-22-12-10-19(26-21)20-14-23-16(3)27(20)4/h6-10,12,14-15,24H,5,11,13H2,1-4H3,(H,22,25,26)
NCI pathway
Reactome pathway
n/an/a 6n/an/an/an/an/an/a
AstraZeneca
Curated by ChEMBL
Assay Description
Inhibition of CDK2
Bioorg Med Chem Lett 18: 5487-92 (2008)
Article DOI: 10.1016/j.bmcl.2008.09.024
BindingDB Entry DOI: 10.7270/Q2J9667K