BDBM50274666 CHEMBL485626::N-[1-(2-carbamoylethyl)-2-[(4-cyanobenzene)amido]-1H-1,3-benzodiazol-5-yl]-4-methoxy-N-methylbenzamide
SMILES: COc1ccc(cc1)C(=O)N(C)c1ccc2n(CCC(N)=O)c(NC(=O)c3ccc(cc3)C#N)nc2c1
InChI Key: InChIKey=QVNRUMIEALUOHI-UHFFFAOYSA-N
Data: 2 IC50
Activity Spreadsheet -- Enzyme Inhibition Constant Data from BindingDB
Found 2 hits for monomerid = 50274666
Trg + Lig
Ki
nM
ΔG°
kcal/mole
IC50
nM
Kd
nM
EC50/IC50
nM
koff
s-1
kon
M-1s-1
pHTemp
°C
Tyrosine-protein kinase ITK/TSK
(Homo sapiens (Human))
BDBM50274666
(CHEMBL485626 | N-[1-(2-carbamoylethyl)-2-[(4-cyano...)
Show SMILES COc1ccc(cc1)C(=O)N(C)c1ccc2n(CCC(N)=O)c(NC(=O)c3ccc(cc3)C#N)nc2c1
Show InChI InChI=1S/C27H24N6O4/c1-32(26(36)19-7-10-21(37-2)11-8-19)20-9-12-23-22(15-20)30-27(33(23)14-13-24(29)34)31-25(35)18-5-3-17(16-28)4-6-18/h3-12,15H,13-14H2,1-2H3,(H2,29,34)(H,30,31,35)
Reactome pathway
n/an/a 7n/an/an/an/an/an/a
Johnson & Johnson
Curated by ChEMBL
Assay Description
Inhibition of recombinant ITK (unknown origin) by DELFIA assay
Bioorg Med Chem Lett 18: 5537-40 (2008)
Article DOI: 10.1016/j.bmcl.2008.09.017
BindingDB Entry DOI: 10.7270/Q208655Z
Tyrosine-protein kinase ITK/TSK
(Homo sapiens (Human))
BDBM50274666
(CHEMBL485626 | N-[1-(2-carbamoylethyl)-2-[(4-cyano...)
Show SMILES COc1ccc(cc1)C(=O)N(C)c1ccc2n(CCC(N)=O)c(NC(=O)c3ccc(cc3)C#N)nc2c1
Show InChI InChI=1S/C27H24N6O4/c1-32(26(36)19-7-10-21(37-2)11-8-19)20-9-12-23-22(15-20)30-27(33(23)14-13-24(29)34)31-25(35)18-5-3-17(16-28)4-6-18/h3-12,15H,13-14H2,1-2H3,(H2,29,34)(H,30,31,35)
Reactome pathway
n/an/a 1.10E+3n/an/an/an/an/an/a
Johnson & Johnson
Curated by ChEMBL
Assay Description
Inhibition of human ITK expressed in chicken DT40 cells assessed as B cell receptor-stimulated calcium influx by FLIPR assay
Bioorg Med Chem Lett 18: 5537-40 (2008)
Article DOI: 10.1016/j.bmcl.2008.09.017
BindingDB Entry DOI: 10.7270/Q208655Z