BDBM50274671 4-cyano-N-(5-(N-methylcyclohexanecarboxamido)-1-(3-(4-methylpiperazin-1-yl)propyl)-1H-benzo[d]imidazol-2-yl)benzamide::CHEMBL523633
SMILES: CN(C(=O)C1CCCCC1)c1ccc2n(CCCN3CCN(C)CC3)c(NC(=O)c3ccc(cc3)C#N)nc2c1
InChI Key: InChIKey=ZPHYAXPSDMTUGL-UHFFFAOYSA-N
Data: 1 IC50
Activity Spreadsheet -- Enzyme Inhibition Constant Data from BindingDB
Found 1 hit for monomerid = 50274671
Trg + Lig
Ki
nM
ΔG°
kcal/mole
IC50
nM
Kd
nM
EC50/IC50
nM
koff
s-1
kon
M-1s-1
pHTemp
°C
Tyrosine-protein kinase ITK/TSK
(Homo sapiens (Human))
BDBM50274671
(4-cyano-N-(5-(N-methylcyclohexanecarboxamido)-1-(3...)
Show SMILES CN(C(=O)C1CCCCC1)c1ccc2n(CCCN3CCN(C)CC3)c(NC(=O)c3ccc(cc3)C#N)nc2c1
Show InChI InChI=1S/C31H39N7O2/c1-35-17-19-37(20-18-35)15-6-16-38-28-14-13-26(36(2)30(40)25-7-4-3-5-8-25)21-27(28)33-31(38)34-29(39)24-11-9-23(22-32)10-12-24/h9-14,21,25H,3-8,15-20H2,1-2H3,(H,33,34,39)
Reactome pathway
n/an/a 5n/an/an/an/an/an/a
Johnson & Johnson
Curated by ChEMBL
Assay Description
Inhibition of ITK by DELFIA assay
Bioorg Med Chem Lett 18: 5545-9 (2008)
Article DOI: 10.1016/j.bmcl.2008.09.015
BindingDB Entry DOI: 10.7270/Q2M32VMD