BDBM50274699 4-(4-(1-isobutyl-2-methyl-1H-imidazol-5-yl)pyrimidin-2-ylamino)-N-(2-methoxyethyl)benzenesulfonamide::CHEMBL485619
SMILES: COCCNS(=O)(=O)c1ccc(Nc2nccc(n2)-c2cnc(C)n2CC(C)C)cc1
InChI Key: InChIKey=DHWHLFAGRRCACI-UHFFFAOYSA-N
Data: 1 IC50
Activity Spreadsheet -- Enzyme Inhibition Constant Data from BindingDB
Found 1 hit for monomerid = 50274699
Trg + Lig
Ki
nM
ΔG°
kcal/mole
IC50
nM
Kd
nM
EC50/IC50
nM
koff
s-1
kon
M-1s-1
pHTemp
°C
Cyclin-dependent kinase 2
(Homo sapiens (Human))
BDBM50274699
(4-(4-(1-isobutyl-2-methyl-1H-imidazol-5-yl)pyrimid...)
Show SMILES COCCNS(=O)(=O)c1ccc(Nc2nccc(n2)-c2cnc(C)n2CC(C)C)cc1
Show InChI InChI=1S/C21H28N6O3S/c1-15(2)14-27-16(3)23-13-20(27)19-9-10-22-21(26-19)25-17-5-7-18(8-6-17)31(28,29)24-11-12-30-4/h5-10,13,15,24H,11-12,14H2,1-4H3,(H,22,25,26)
NCI pathway
Reactome pathway
n/an/a 15n/an/an/an/an/an/a
AstraZeneca
Curated by ChEMBL
Assay Description
Inhibition of CDK2
Bioorg Med Chem Lett 18: 5487-92 (2008)
Article DOI: 10.1016/j.bmcl.2008.09.024
BindingDB Entry DOI: 10.7270/Q2J9667K