BDBM50274706 4-cyano-N-(5-(N-methylcyclohexanecarboxamido)-1-(3-(4-methylpiperazin-1-yl)-3-oxopropyl)-1H-benzo[d]imidazol-2-yl)benzamide::CHEMBL444151
SMILES: CN(C(=O)C1CCCCC1)c1ccc2n(CCC(=O)N3CCN(C)CC3)c(NC(=O)c3ccc(cc3)C#N)nc2c1
InChI Key: InChIKey=LQSWRIATHMQJMW-UHFFFAOYSA-N
Data: 1 IC50
Activity Spreadsheet -- Enzyme Inhibition Constant Data from BindingDB
Found 1 hit for monomerid = 50274706
Trg + Lig
Ki
nM
ΔG°
kcal/mole
IC50
nM
Kd
nM
EC50/IC50
nM
koff
s-1
kon
M-1s-1
pHTemp
°C
Tyrosine-protein kinase ITK/TSK
(Homo sapiens (Human))
BDBM50274706
(4-cyano-N-(5-(N-methylcyclohexanecarboxamido)-1-(3...)
Show SMILES CN(C(=O)C1CCCCC1)c1ccc2n(CCC(=O)N3CCN(C)CC3)c(NC(=O)c3ccc(cc3)C#N)nc2c1
Show InChI InChI=1S/C31H37N7O3/c1-35-16-18-37(19-17-35)28(39)14-15-38-27-13-12-25(36(2)30(41)24-6-4-3-5-7-24)20-26(27)33-31(38)34-29(40)23-10-8-22(21-32)9-11-23/h8-13,20,24H,3-7,14-19H2,1-2H3,(H,33,34,40)
Reactome pathway
n/an/a 18n/an/an/an/an/an/a
Johnson & Johnson
Curated by ChEMBL
Assay Description
Inhibition of ITK by DELFIA assay
Bioorg Med Chem Lett 18: 5545-9 (2008)
Article DOI: 10.1016/j.bmcl.2008.09.015
BindingDB Entry DOI: 10.7270/Q2M32VMD