BDBM50274724 CHEMBL458623::N-[(1,1-Dimethylethoxy)carbonyl]-L-leucine-(1S)-1-[[(2S,3S)-3-hexyl-4-oxo-2-oxetanyl]methyl]dodecyl Ester
SMILES: CCCCCCCCCCC[C@@H](C[C@@H]1OC(=O)[C@H]1CCCCCC)OC(=O)[C@H](CC(C)C)NC(=O)OC(C)(C)C
InChI Key: InChIKey=QPHIZYHQRDPNLA-DZUOILHNSA-N
Data: 2 IC50
Activity Spreadsheet -- Enzyme Inhibition Constant Data from BindingDB
Found 2 hits for monomerid = 50274724
Trg + Lig
Ki
nM
ΔG°
kcal/mole
IC50
nM
Kd
nM
EC50/IC50
nM
koff
s-1
kon
M-1s-1
pHTemp
°C
Fatty-acid amide hydrolase 1 (aa 30-579)
(Rattus norvegicus (rat))
BDBM50274724
(CHEMBL458623 | N-[(1,1-Dimethylethoxy)carbonyl]-L-...)
Show SMILES CCCCCCCCCCC[C@@H](C[C@@H]1OC(=O)[C@H]1CCCCCC)OC(=O)[C@H](CC(C)C)NC(=O)OC(C)(C)C |r|
Show InChI InChI=1S/C33H61NO6/c1-8-10-12-14-15-16-17-18-19-21-26(24-29-27(30(35)39-29)22-20-13-11-9-2)38-31(36)28(23-25(3)4)34-32(37)40-33(5,6)7/h25-29H,8-24H2,1-7H3,(H,34,37)/t26-,27-,28-,29-/m0/s1
n/an/a>5.00E+4n/an/an/an/an/an/a
Sapienza Università di Roma
Curated by ChEMBL
Assay Description
Inhibition of FAAH-mediated [14C]anadamide hydrolysis in rat brain membrane
J Med Chem 51: 6970-9 (2008)
Article DOI: 10.1021/jm800978m
BindingDB Entry DOI: 10.7270/Q2251J1D
Sn1-specific diacylglycerol lipase alpha
(Homo sapiens (Human))
BDBM50274724
(CHEMBL458623 | N-[(1,1-Dimethylethoxy)carbonyl]-L-...)
Show SMILES CCCCCCCCCCC[C@@H](C[C@@H]1OC(=O)[C@H]1CCCCCC)OC(=O)[C@H](CC(C)C)NC(=O)OC(C)(C)C |r|
Show InChI InChI=1S/C33H61NO6/c1-8-10-12-14-15-16-17-18-19-21-26(24-29-27(30(35)39-29)22-20-13-11-9-2)38-31(36)28(23-25(3)4)34-32(37)40-33(5,6)7/h25-29H,8-24H2,1-7H3,(H,34,37)/t26-,27-,28-,29-/m0/s1
NCI pathway
Reactome pathway
n/an/a>2.50E+4n/an/an/an/an/an/a
Sapienza Università di Roma
Curated by ChEMBL
Assay Description
Inhibition of human recombinant DAGLalpha-mediated sn-1-[14C]oleoyl-2-arachidonoyl-glycerol hydrolysis to 2-AG overexpressed in african green monkey ...
J Med Chem 51: 6970-9 (2008)
Article DOI: 10.1021/jm800978m
BindingDB Entry DOI: 10.7270/Q2251J1D