BDBM50274776 CHEMBL457736::L-Leucine-(1S)-1-[[(2S,3S)-3-hexyl-4-oxo-2-oxetanyl]methyl]dodecyl Ester
SMILES: CCCCCCCCCCC[C@@H](C[C@@H]1OC(=O)[C@H]1CCCCCC)OC(=O)[C@@H](N)CC(C)C
InChI Key: InChIKey=GIETWVLMMDTRGZ-CQJMVLFOSA-N
Data: 2 IC50
Activity Spreadsheet -- Enzyme Inhibition Constant Data from BindingDB
Found 2 hits for monomerid = 50274776
Trg + Lig
Ki
nM
ΔG°
kcal/mole
IC50
nM
Kd
nM
EC50/IC50
nM
koff
s-1
kon
M-1s-1
pHTemp
°C
Sn1-specific diacylglycerol lipase alpha
(Homo sapiens (Human))
BDBM50274776
(CHEMBL457736 | L-Leucine-(1S)-1-[[(2S,3S)-3-hexyl-...)
Show SMILES CCCCCCCCCCC[C@@H](C[C@@H]1OC(=O)[C@H]1CCCCCC)OC(=O)[C@@H](N)CC(C)C |r|
Show InChI InChI=1S/C28H53NO4/c1-5-7-9-11-12-13-14-15-16-18-23(32-28(31)25(29)20-22(3)4)21-26-24(27(30)33-26)19-17-10-8-6-2/h22-26H,5-21,29H2,1-4H3/t23-,24-,25-,26-/m0/s1
NCI pathway
Reactome pathway
n/an/a>2.50E+4n/an/an/an/an/an/a
Sapienza Università di Roma
Curated by ChEMBL
Assay Description
Inhibition of human recombinant DAGLalpha-mediated sn-1-[14C]oleoyl-2-arachidonoyl-glycerol hydrolysis to 2-AG overexpressed in african green monkey ...
J Med Chem 51: 6970-9 (2008)
Article DOI: 10.1021/jm800978m
BindingDB Entry DOI: 10.7270/Q2251J1D
Fatty-acid amide hydrolase 1 (aa 30-579)
(Rattus norvegicus (rat))
BDBM50274776
(CHEMBL457736 | L-Leucine-(1S)-1-[[(2S,3S)-3-hexyl-...)
Show SMILES CCCCCCCCCCC[C@@H](C[C@@H]1OC(=O)[C@H]1CCCCCC)OC(=O)[C@@H](N)CC(C)C |r|
Show InChI InChI=1S/C28H53NO4/c1-5-7-9-11-12-13-14-15-16-18-23(32-28(31)25(29)20-22(3)4)21-26-24(27(30)33-26)19-17-10-8-6-2/h22-26H,5-21,29H2,1-4H3/t23-,24-,25-,26-/m0/s1
n/an/a>5.00E+4n/an/an/an/an/an/a
Sapienza Università di Roma
Curated by ChEMBL
Assay Description
Inhibition of FAAH-mediated [14C]anadamide hydrolysis in rat brain membrane
J Med Chem 51: 6970-9 (2008)
Article DOI: 10.1021/jm800978m
BindingDB Entry DOI: 10.7270/Q2251J1D