BDBM50275216 CHEMBL4130040
SMILES: CC\C=C/C\C=C/C\C=C/C\C=C/C=C/C(=O)CCCC(=O)OC
InChI Key: InChIKey=GMLNYELUXRVLGZ-OSDQZAHSSA-N
Data: 1 EC50
Activity Spreadsheet -- Enzyme Inhibition Constant Data from BindingDB
Found 1 hit for monomerid = 50275216
Trg + Lig
Ki
nM
ΔG°
kcal/mole
IC50
nM
Kd
nM
EC50/IC50
nM
koff
s-1
kon
M-1s-1
pHTemp
°C
TG 1019
(Homo sapiens (Human))
BDBM50275216
(CHEMBL4130040)
Show SMILES CC\C=C/C\C=C/C\C=C/C\C=C/C=C/C(=O)CCCC(=O)OC
Show InChI InChI=1S/C21H30O3/c1-3-4-5-6-7-8-9-10-11-12-13-14-15-17-20(22)18-16-19-21(23)24-2/h4-5,7-8,10-11,13-15,17H,3,6,9,12,16,18-19H2,1-2H3/b5-4-,8-7-,11-10-,14-13-,17-15+
n/an/an/an/a 2.08E+3n/an/an/an/a
Hospital del Mar Medical Research Institute (IMIM)
Curated by ChEMBL
Assay Description
Agonist activity at human PK-tagged OXER1 expressed in CHOK1 cells assessed as EA-tagged beta-arrestin recruitment by beta-galactosidase enzyme fragm...
Bioorg Med Chem 26: 3580-3587 (2018)
Article DOI: 10.1016/j.bmc.2018.05.036
BindingDB Entry DOI: 10.7270/Q2X63QFQ