BDBM50275307 3-((Acetoxy)-1-methylpropyl)dimethylammonium Oxalate::CHEMBL442890
SMILES: CC(CCOC(C)=O)N(C)C
InChI Key: InChIKey=SMCITBQUXPYNBU-UHFFFAOYSA-N
Data: 4 KI  1 EC50
Activity Spreadsheet -- Enzyme Inhibition Constant Data from BindingDB
Found 5 hits for monomerid = 50275307
Trg + Lig
Ki
nM
ΔG°
kcal/mole
IC50
nM
Kd
nM
EC50/IC50
nM
koff
s-1
kon
M-1s-1
pHTemp
°C
Neuronal acetylcholine receptor
(Rattus norvegicus (Rat))
BDBM50275307
(3-((Acetoxy)-1-methylpropyl)dimethylammonium Oxala...)
Show SMILES CC(CCOC(C)=O)N(C)C
Show InChI InChI=1S/C8H17NO2/c1-7(9(3)4)5-6-11-8(2)10/h7H,5-6H2,1-4H3
65n/an/an/an/an/an/an/an/a
University of Copenhagen
Curated by ChEMBL
Assay Description
Displacement of [3H]epibatidine from rat recombinant alpha4beta2 nAChR expressed in HEK293 cells
J Med Chem 51: 7380-95 (2009)
Article DOI: 10.1021/jm701625v
BindingDB Entry DOI: 10.7270/Q2DF6S4D
Neuronal acetylcholine receptor
(Rattus norvegicus (Rat))
BDBM50275307
(3-((Acetoxy)-1-methylpropyl)dimethylammonium Oxala...)
Show SMILES CC(CCOC(C)=O)N(C)C
Show InChI InChI=1S/C8H17NO2/c1-7(9(3)4)5-6-11-8(2)10/h7H,5-6H2,1-4H3
370n/an/an/an/an/an/an/an/a
University of Copenhagen
Curated by ChEMBL
Assay Description
Displacement of [3H]epibatidine from rat recombinant alpha-4-beta-4 nAChR expressed in HEK293 cells
J Med Chem 51: 7380-95 (2009)
Article DOI: 10.1021/jm701625v
BindingDB Entry DOI: 10.7270/Q2DF6S4D
Neuronal acetylcholine receptor subunit alpha-3
(Rattus norvegicus (Rat))
BDBM50275307
(3-((Acetoxy)-1-methylpropyl)dimethylammonium Oxala...)
Show SMILES CC(CCOC(C)=O)N(C)C
Show InChI InChI=1S/C8H17NO2/c1-7(9(3)4)5-6-11-8(2)10/h7H,5-6H2,1-4H3
4.10E+3n/an/an/an/an/an/an/an/a
University of Copenhagen
Curated by ChEMBL
Assay Description
Displacement of [3H]epibatidine from rat recombinant alpha-3-beta-4 nAChR expressed in HEK293 cells
J Med Chem 51: 7380-95 (2009)
Article DOI: 10.1021/jm701625v
BindingDB Entry DOI: 10.7270/Q2DF6S4D
Neuronal acetylcholine receptor
(Rattus norvegicus (Rat))
BDBM50275307
(3-((Acetoxy)-1-methylpropyl)dimethylammonium Oxala...)
Show SMILES CC(CCOC(C)=O)N(C)C
Show InChI InChI=1S/C8H17NO2/c1-7(9(3)4)5-6-11-8(2)10/h7H,5-6H2,1-4H3
Reactome pathway
>1.00E+6n/an/an/an/an/an/an/an/a
University of Copenhagen
Curated by ChEMBL
Assay Description
Displacement of [3H]MLA from rat alpha-7 nAChR/mouse 5HT3A chimera expressed in human tsA-201 cells
J Med Chem 51: 7380-95 (2009)
Article DOI: 10.1021/jm701625v
BindingDB Entry DOI: 10.7270/Q2DF6S4D
Neuronal acetylcholine receptor subunit alpha-3
(Rattus norvegicus (Rat))
BDBM50275307
(3-((Acetoxy)-1-methylpropyl)dimethylammonium Oxala...)
Show SMILES CC(CCOC(C)=O)N(C)C
Show InChI InChI=1S/C8H17NO2/c1-7(9(3)4)5-6-11-8(2)10/h7H,5-6H2,1-4H3
n/an/an/an/a 2.30E+4n/an/an/an/a
University of Copenhagen
Curated by ChEMBL
Assay Description
Agonist activity at rat alpha-3-beta-4 nAChR expressed in HEK293 cells by FMP assay
J Med Chem 51: 7380-95 (2009)
Article DOI: 10.1021/jm701625v
BindingDB Entry DOI: 10.7270/Q2DF6S4D