BDBM50275492 (S)-N-(1-(5-(4-chlorophenyl)-1H-imidazol-2-yl)-7-oxooctyl)-1-methylpiperidine-4-carboxamide::CHEMBL520526
SMILES: CN1CCC(CC1)C(=O)N[C@@H](CCCCCC(C)=O)c1nc(c[nH]1)-c1ccc(Cl)cc1
InChI Key: InChIKey=DHQXWGLSHGBIEK-NRFANRHFSA-N
Data: 1 IC50
Activity Spreadsheet -- Enzyme Inhibition Constant Data from BindingDB
Found 1 hit for monomerid = 50275492
Trg + Lig
Ki
nM
ΔG°
kcal/mole
IC50
nM
Kd
nM
EC50/IC50
nM
koff
s-1
kon
M-1s-1
pHTemp
°C
Histone deacetylase 1
(Homo sapiens (Human))
BDBM50275492
((S)-N-(1-(5-(4-chlorophenyl)-1H-imidazol-2-yl)-7-o...)
Show SMILES CN1CCC(CC1)C(=O)N[C@@H](CCCCCC(C)=O)c1nc(c[nH]1)-c1ccc(Cl)cc1 |r|
Show InChI InChI=1S/C24H33ClN4O2/c1-17(30)6-4-3-5-7-21(28-24(31)19-12-14-29(2)15-13-19)23-26-16-22(27-23)18-8-10-20(25)11-9-18/h8-11,16,19,21H,3-7,12-15H2,1-2H3,(H,26,27)(H,28,31)/t21-/m0/s1
NCI pathway
Reactome pathway
n/an/a 75n/an/an/an/an/an/a
IRBM/Merck Research Laboratories
Curated by ChEMBL
Assay Description
Inhibition of human recombinant C-terminally flag tagged HDAC1
Bioorg Med Chem Lett 18: 5528-32 (2008)
Article DOI: 10.1016/j.bmcl.2008.09.003
BindingDB Entry DOI: 10.7270/Q24T6K81