BDBM50275500 4-fluoro-2-(4-fluorophenyl)-3-(pyridin-4-yl)pyrazolo[1,5-a]pyridine::CHEMBL509189
SMILES: Fc1ccc(cc1)-c1nn2cccc(F)c2c1-c1ccncc1
InChI Key: InChIKey=VFCFJSWYTMMESK-UHFFFAOYSA-N
Data: 1 IC50
Activity Spreadsheet -- Enzyme Inhibition Constant Data from BindingDB
Found 1 hit for monomerid = 50275500
Trg + Lig
Ki
nM
ΔG°
kcal/mole
IC50
nM
Kd
nM
EC50/IC50
nM
koff
s-1
kon
M-1s-1
pHTemp
°C
Mitogen-activated protein kinase 14
(Homo sapiens (Human))
BDBM50275500
(4-fluoro-2-(4-fluorophenyl)-3-(pyridin-4-yl)pyrazo...)
Show SMILES Fc1ccc(cc1)-c1nn2cccc(F)c2c1-c1ccncc1
Show InChI InChI=1S/C18H11F2N3/c19-14-5-3-13(4-6-14)17-16(12-7-9-21-10-8-12)18-15(20)2-1-11-23(18)22-17/h1-11H
NCI pathway
Reactome pathway
n/an/a 240n/an/an/an/an/an/a
GlaxoSmithKline
Curated by ChEMBL
Assay Description
Inhibition of GST-fused p38alpha (unknown origin) expressed in Escherichia coli
Bioorg Med Chem Lett 18: 5428-30 (2008)
Article DOI: 10.1016/j.bmcl.2008.09.040
BindingDB Entry DOI: 10.7270/Q27S7NM9