BDBM50275542 (S)-N-(1-(5-(biphenyl-4-yl)-1H-imidazol-2-yl)-7-oxooctyl)-1-methylpiperidine-4-carboxamide::CHEMBL519716
SMILES: CN1CCC(CC1)C(=O)N[C@@H](CCCCCC(C)=O)c1nc(c[nH]1)-c1ccc(cc1)-c1ccccc1
InChI Key: InChIKey=VFWKZLPTQCSNKW-MHZLTWQESA-N
Data: 1 IC50
Activity Spreadsheet -- Enzyme Inhibition Constant Data from BindingDB
Found 1 hit for monomerid = 50275542
Trg + Lig
Ki
nM
ΔG°
kcal/mole
IC50
nM
Kd
nM
EC50/IC50
nM
koff
s-1
kon
M-1s-1
pHTemp
°C
Histone deacetylase 1
(Homo sapiens (Human))
BDBM50275542
((S)-N-(1-(5-(biphenyl-4-yl)-1H-imidazol-2-yl)-7-ox...)
Show SMILES CN1CCC(CC1)C(=O)N[C@@H](CCCCCC(C)=O)c1nc(c[nH]1)-c1ccc(cc1)-c1ccccc1 |r|
Show InChI InChI=1S/C30H38N4O2/c1-22(35)9-5-3-8-12-27(33-30(36)26-17-19-34(2)20-18-26)29-31-21-28(32-29)25-15-13-24(14-16-25)23-10-6-4-7-11-23/h4,6-7,10-11,13-16,21,26-27H,3,5,8-9,12,17-20H2,1-2H3,(H,31,32)(H,33,36)/t27-/m0/s1
NCI pathway
Reactome pathway
n/an/a 50n/an/an/an/an/an/a
IRBM/Merck Research Laboratories
Curated by ChEMBL
Assay Description
Inhibition of human recombinant C-terminally flag tagged HDAC1
Bioorg Med Chem Lett 18: 5528-32 (2008)
Article DOI: 10.1016/j.bmcl.2008.09.003
BindingDB Entry DOI: 10.7270/Q24T6K81