BDBM50275548 2-(4-fluorophenyl)-4-methyl-3-(pyridin-4-yl)pyrazolo[1,5-a]pyridine::CHEMBL487577
SMILES: Cc1cccn2nc(c(-c3ccncc3)c12)-c1ccc(F)cc1
InChI Key: InChIKey=VIZCBYUHVQUFPM-UHFFFAOYSA-N
Data: 1 IC50
Activity Spreadsheet -- Enzyme Inhibition Constant Data from BindingDB
Found 1 hit for monomerid = 50275548
Trg + Lig
Ki
nM
ΔG°
kcal/mole
IC50
nM
Kd
nM
EC50/IC50
nM
koff
s-1
kon
M-1s-1
pHTemp
°C
Mitogen-activated protein kinase 14
(Homo sapiens (Human))
BDBM50275548
(2-(4-fluorophenyl)-4-methyl-3-(pyridin-4-yl)pyrazo...)
Show SMILES Cc1cccn2nc(c(-c3ccncc3)c12)-c1ccc(F)cc1
Show InChI InChI=1S/C19H14FN3/c1-13-3-2-12-23-19(13)17(14-8-10-21-11-9-14)18(22-23)15-4-6-16(20)7-5-15/h2-12H,1H3
NCI pathway
Reactome pathway
n/an/a 280n/an/an/an/an/an/a
GlaxoSmithKline
Curated by ChEMBL
Assay Description
Inhibition of GST-fused p38alpha (unknown origin) expressed in Escherichia coli
Bioorg Med Chem Lett 18: 5428-30 (2008)
Article DOI: 10.1016/j.bmcl.2008.09.040
BindingDB Entry DOI: 10.7270/Q27S7NM9