BDBM50275575 (S)-N-(1-(5-(3-cyanophenyl)-1H-imidazol-2-yl)-7-oxooctyl)-1-methylpiperidine-4-carboxamide::CHEMBL487578
SMILES: CN1CCC(CC1)C(=O)N[C@@H](CCCCCC(C)=O)c1nc(c[nH]1)-c1cccc(c1)C#N
InChI Key: InChIKey=ZLEQWQDSHAKTHV-QFIPXVFZSA-N
Data: 1 IC50
Activity Spreadsheet -- Enzyme Inhibition Constant Data from BindingDB
Found 1 hit for monomerid = 50275575
Trg + Lig
Ki
nM
ΔG°
kcal/mole
IC50
nM
Kd
nM
EC50/IC50
nM
koff
s-1
kon
M-1s-1
pHTemp
°C
Histone deacetylase 1
(Homo sapiens (Human))
BDBM50275575
((S)-N-(1-(5-(3-cyanophenyl)-1H-imidazol-2-yl)-7-ox...)
Show SMILES CN1CCC(CC1)C(=O)N[C@@H](CCCCCC(C)=O)c1nc(c[nH]1)-c1cccc(c1)C#N |r|
Show InChI InChI=1S/C25H33N5O2/c1-18(31)7-4-3-5-10-22(29-25(32)20-11-13-30(2)14-12-20)24-27-17-23(28-24)21-9-6-8-19(15-21)16-26/h6,8-9,15,17,20,22H,3-5,7,10-14H2,1-2H3,(H,27,28)(H,29,32)/t22-/m0/s1
NCI pathway
Reactome pathway
n/an/a 480n/an/an/an/an/an/a
IRBM/Merck Research Laboratories
Curated by ChEMBL
Assay Description
Inhibition of human recombinant C-terminally flag tagged HDAC1
Bioorg Med Chem Lett 18: 5528-32 (2008)
Article DOI: 10.1016/j.bmcl.2008.09.003
BindingDB Entry DOI: 10.7270/Q24T6K81