BDBM50275609 (S)-N-(1-(5-(benzo[b]thiophen-3-yl)-1H-imidazol-2-yl)-7-oxooctyl)-1-methylpiperidine-4-carboxamide::CHEMBL519541
SMILES: CN1CCC(CC1)C(=O)N[C@@H](CCCCCC(C)=O)c1nc(c[nH]1)-c1csc2ccccc12
InChI Key: InChIKey=JZUGAVWOEVAHTA-QFIPXVFZSA-N
Data: 1 IC50
Activity Spreadsheet -- Enzyme Inhibition Constant Data from BindingDB
Found 1 hit for monomerid = 50275609
Trg + Lig
Ki
nM
ΔG°
kcal/mole
IC50
nM
Kd
nM
EC50/IC50
nM
koff
s-1
kon
M-1s-1
pHTemp
°C
Histone deacetylase 1
(Homo sapiens (Human))
BDBM50275609
((S)-N-(1-(5-(benzo[b]thiophen-3-yl)-1H-imidazol-2-...)
Show SMILES CN1CCC(CC1)C(=O)N[C@@H](CCCCCC(C)=O)c1nc(c[nH]1)-c1csc2ccccc12 |r|
Show InChI InChI=1S/C26H34N4O2S/c1-18(31)8-4-3-5-10-22(29-26(32)19-12-14-30(2)15-13-19)25-27-16-23(28-25)21-17-33-24-11-7-6-9-20(21)24/h6-7,9,11,16-17,19,22H,3-5,8,10,12-15H2,1-2H3,(H,27,28)(H,29,32)/t22-/m0/s1
NCI pathway
Reactome pathway
n/an/a 180n/an/an/an/an/an/a
IRBM/Merck Research Laboratories
Curated by ChEMBL
Assay Description
Inhibition of human recombinant C-terminally flag tagged HDAC1
Bioorg Med Chem Lett 18: 5528-32 (2008)
Article DOI: 10.1016/j.bmcl.2008.09.003
BindingDB Entry DOI: 10.7270/Q24T6K81