BDBM50275614 2-(4-fluorophenyl)-3-(pyridin-4-yl)-7-(2,2,2-trifluoroethoxy)pyrazolo[1,5-a]pyridine::CHEMBL518890
SMILES: Fc1ccc(cc1)-c1nn2c(OCC(F)(F)F)cccc2c1-c1ccncc1
InChI Key: InChIKey=MUJSVAMMIKEZPF-UHFFFAOYSA-N
Data: 1 IC50
Activity Spreadsheet -- Enzyme Inhibition Constant Data from BindingDB
Found 1 hit for monomerid = 50275614
Trg + Lig
Ki
nM
ΔG°
kcal/mole
IC50
nM
Kd
nM
EC50/IC50
nM
koff
s-1
kon
M-1s-1
pHTemp
°C
Mitogen-activated protein kinase 14
(Homo sapiens (Human))
BDBM50275614
(2-(4-fluorophenyl)-3-(pyridin-4-yl)-7-(2,2,2-trifl...)
Show SMILES Fc1ccc(cc1)-c1nn2c(OCC(F)(F)F)cccc2c1-c1ccncc1
Show InChI InChI=1S/C20H13F4N3O/c21-15-6-4-14(5-7-15)19-18(13-8-10-25-11-9-13)16-2-1-3-17(27(16)26-19)28-12-20(22,23)24/h1-11H,12H2
NCI pathway
Reactome pathway
n/an/a 70n/an/an/an/an/an/a
GlaxoSmithKline
Curated by ChEMBL
Assay Description
Inhibition of GST-fused p38alpha (unknown origin) expressed in Escherichia coli
Bioorg Med Chem Lett 18: 5428-30 (2008)
Article DOI: 10.1016/j.bmcl.2008.09.040
BindingDB Entry DOI: 10.7270/Q27S7NM9