BDBM50275861 4-{5-[4-(2-Pyrrolidin-1-yl-ethoxy)-phenyl]-2,3-dihydrobenzo[b]oxepin-4-yl}-phenol::CHEMBL470993
SMILES: Oc1ccc(cc1)C1=C(c2ccc(OCCN3CCC3)cc2)c2ccccc2OCC1
InChI Key: InChIKey=MFDXIQNXGJGENZ-UHFFFAOYSA-N
Data: 2 IC50
Activity Spreadsheet -- Enzyme Inhibition Constant Data from BindingDB
Found 2 hits for monomerid = 50275861
Trg + Lig
Ki
nM
ΔG°
kcal/mole
IC50
nM
Kd
nM
EC50/IC50
nM
koff
s-1
kon
M-1s-1
pHTemp
°C
Estradiol receptor beta (ERβ)
(Homo sapiens (Human))
BDBM50275861
(4-{5-[4-(2-Pyrrolidin-1-yl-ethoxy)-phenyl]-2,3-dih...)
Show SMILES Oc1ccc(cc1)C1=C(c2ccc(OCCN3CCC3)cc2)c2ccccc2OCC1 |c:8|
Show InChI InChI=1S/C27H27NO3/c29-22-10-6-20(7-11-22)24-14-18-31-26-5-2-1-4-25(26)27(24)21-8-12-23(13-9-21)30-19-17-28-15-3-16-28/h1-2,4-13,29H,3,14-19H2
n/an/a 5.90n/an/an/an/an/an/a
Trinity College
Curated by ChEMBL
Assay Description
Displacement of fluorescein labeled estradiol from human recombinant ERbeta expressed in baculovirus infected insect cells by fluorescence polarizati...
Bioorg Med Chem 16: 9554-73 (2008)
Article DOI: 10.1016/j.bmc.2008.09.035
BindingDB Entry DOI: 10.7270/Q2MW2GZ8
Estrogen receptor
(Homo sapiens (Human))
BDBM50275861
(4-{5-[4-(2-Pyrrolidin-1-yl-ethoxy)-phenyl]-2,3-dih...)
Show SMILES Oc1ccc(cc1)C1=C(c2ccc(OCCN3CCC3)cc2)c2ccccc2OCC1 |c:8|
Show InChI InChI=1S/C27H27NO3/c29-22-10-6-20(7-11-22)24-14-18-31-26-5-2-1-4-25(26)27(24)21-8-12-23(13-9-21)30-19-17-28-15-3-16-28/h1-2,4-13,29H,3,14-19H2
n/an/a 1.90n/an/an/an/an/an/a
Trinity College
Curated by ChEMBL
Assay Description
Displacement of fluorescein labeled estradiol from human recombinant ERalpha expressed in baculovirus infected insect cells by fluorescence polarizat...
Bioorg Med Chem 16: 9554-73 (2008)
Article DOI: 10.1016/j.bmc.2008.09.035
BindingDB Entry DOI: 10.7270/Q2MW2GZ8