BDBM50275966 1-(2-{4-[8-Fluoro-4-(4-fluorophenyl)-2,3-dihydro-benzo[b]-oxepin-5-yl]-phenoxy}-ethyl)-pyrrolidine::CHEMBL511492
SMILES: Fc1ccc(cc1)C1=C(c2ccc(OCCN3CCCC3)cc2)c2ccc(F)cc2OCC1
InChI Key: InChIKey=DVBULXMSJAHUEU-UHFFFAOYSA-N
Data: 2 IC50
Activity Spreadsheet -- Enzyme Inhibition Constant Data from BindingDB
Found 2 hits for monomerid = 50275966
Trg + Lig
Ki
nM
ΔG°
kcal/mole
IC50
nM
Kd
nM
EC50/IC50
nM
koff
s-1
kon
M-1s-1
pHTemp
°C
Estradiol receptor beta (ERβ)
(Homo sapiens (Human))
BDBM50275966
(1-(2-{4-[8-Fluoro-4-(4-fluorophenyl)-2,3-dihydro-b...)
Show SMILES Fc1ccc(cc1)C1=C(c2ccc(OCCN3CCCC3)cc2)c2ccc(F)cc2OCC1 |c:8|
Show InChI InChI=1S/C28H27F2NO2/c29-22-7-3-20(4-8-22)25-13-17-33-27-19-23(30)9-12-26(27)28(25)21-5-10-24(11-6-21)32-18-16-31-14-1-2-15-31/h3-12,19H,1-2,13-18H2
n/an/a 262n/an/an/an/an/an/a
Trinity College
Curated by ChEMBL
Assay Description
Displacement of fluorescein labeled estradiol from human recombinant ERbeta expressed in baculovirus infected insect cells by fluorescence polarizati...
Bioorg Med Chem 16: 9554-73 (2008)
Article DOI: 10.1016/j.bmc.2008.09.035
BindingDB Entry DOI: 10.7270/Q2MW2GZ8
Estrogen receptor
(Homo sapiens (Human))
BDBM50275966
(1-(2-{4-[8-Fluoro-4-(4-fluorophenyl)-2,3-dihydro-b...)
Show SMILES Fc1ccc(cc1)C1=C(c2ccc(OCCN3CCCC3)cc2)c2ccc(F)cc2OCC1 |c:8|
Show InChI InChI=1S/C28H27F2NO2/c29-22-7-3-20(4-8-22)25-13-17-33-27-19-23(30)9-12-26(27)28(25)21-5-10-24(11-6-21)32-18-16-31-14-1-2-15-31/h3-12,19H,1-2,13-18H2
n/an/a 126n/an/an/an/an/an/a
Trinity College
Curated by ChEMBL
Assay Description
Displacement of fluorescein labeled estradiol from human recombinant ERalpha expressed in baculovirus infected insect cells by fluorescence polarizat...
Bioorg Med Chem 16: 9554-73 (2008)
Article DOI: 10.1016/j.bmc.2008.09.035
BindingDB Entry DOI: 10.7270/Q2MW2GZ8