BDBM50276168 (2R,4aR,10aR)-4a-Allyl-2-prop-1-ynyl-1,2,3,4,4a,9,10,10a-octahydro-phenanthrene-2,7-diol::CHEMBL470785
SMILES: CC#C[C@@]1(O)CC[C@]2(CC=C)[C@H](CCc3cc(O)ccc23)C1
InChI Key: InChIKey=YTKAYWYQPDHXNV-NSISKUIASA-N
Data: 7 IC50
Activity Spreadsheet -- Enzyme Inhibition Constant Data from BindingDB
Found 7 hits for monomerid = 50276168
Trg + Lig
Ki
nM
ΔG°
kcal/mole
IC50
nM
Kd
nM
EC50/IC50
nM
koff
s-1
kon
M-1s-1
pHTemp
°C
Androgen Receptor
(Homo sapiens (Human))
BDBM50276168
((2R,4aR,10aR)-4a-Allyl-2-prop-1-ynyl-1,2,3,4,4a,9,...)
Show SMILES CC#C[C@@]1(O)CC[C@]2(CC=C)[C@H](CCc3cc(O)ccc23)C1 |r|
Show InChI InChI=1S/C20H24O2/c1-3-9-19(22)11-12-20(10-4-2)16(14-19)6-5-15-13-17(21)7-8-18(15)20/h4,7-8,13,16,21-22H,2,5-6,10-12,14H2,1H3/t16-,19-,20-/m1/s1
NCI pathway
Reactome pathway
n/an/a>1.00E+4n/an/an/an/an/an/a
Pfizer Global Research & Development
Curated by ChEMBL
Assay Description
Binding affinity to human androgen receptor
J Med Chem 52: 1731-43 (2009)
Article DOI: 10.1021/jm801512v
BindingDB Entry DOI: 10.7270/Q23778M0
Estradiol receptor beta (ERβ)
(Homo sapiens (Human))
BDBM50276168
((2R,4aR,10aR)-4a-Allyl-2-prop-1-ynyl-1,2,3,4,4a,9,...)
Show SMILES CC#C[C@@]1(O)CC[C@]2(CC=C)[C@H](CCc3cc(O)ccc23)C1 |r|
Show InChI InChI=1S/C20H24O2/c1-3-9-19(22)11-12-20(10-4-2)16(14-19)6-5-15-13-17(21)7-8-18(15)20/h4,7-8,13,16,21-22H,2,5-6,10-12,14H2,1H3/t16-,19-,20-/m1/s1
n/an/a 250n/an/an/an/an/an/a
Pfizer Global Research & Development
Curated by ChEMBL
Assay Description
Binding affinity to human ERbeta
J Med Chem 52: 1731-43 (2009)
Article DOI: 10.1021/jm801512v
BindingDB Entry DOI: 10.7270/Q23778M0
Estrogen receptor
(Homo sapiens (Human))
BDBM50276168
((2R,4aR,10aR)-4a-Allyl-2-prop-1-ynyl-1,2,3,4,4a,9,...)
Show SMILES CC#C[C@@]1(O)CC[C@]2(CC=C)[C@H](CCc3cc(O)ccc23)C1 |r|
Show InChI InChI=1S/C20H24O2/c1-3-9-19(22)11-12-20(10-4-2)16(14-19)6-5-15-13-17(21)7-8-18(15)20/h4,7-8,13,16,21-22H,2,5-6,10-12,14H2,1H3/t16-,19-,20-/m1/s1
n/an/a 93n/an/an/an/an/an/a
Pfizer Global Research & Development
Curated by ChEMBL
Assay Description
Binding affinity to human ERalpha
J Med Chem 52: 1731-43 (2009)
Article DOI: 10.1021/jm801512v
BindingDB Entry DOI: 10.7270/Q23778M0
Glucocorticoid receptor
(Homo sapiens (Human))
BDBM50276168
((2R,4aR,10aR)-4a-Allyl-2-prop-1-ynyl-1,2,3,4,4a,9,...)
Show SMILES CC#C[C@@]1(O)CC[C@]2(CC=C)[C@H](CCc3cc(O)ccc23)C1 |r|
Show InChI InChI=1S/C20H24O2/c1-3-9-19(22)11-12-20(10-4-2)16(14-19)6-5-15-13-17(21)7-8-18(15)20/h4,7-8,13,16,21-22H,2,5-6,10-12,14H2,1H3/t16-,19-,20-/m1/s1
n/an/a 34n/an/an/an/an/an/a
Pfizer Global Research & Development
Curated by ChEMBL
Assay Description
Transrepression activity at GR in human SW1353 cells assessed as supression of NFkappaB-induced IL8 production
J Med Chem 52: 1731-43 (2009)
Article DOI: 10.1021/jm801512v
BindingDB Entry DOI: 10.7270/Q23778M0
Progesterone receptor
(Homo sapiens (Human))
BDBM50276168
((2R,4aR,10aR)-4a-Allyl-2-prop-1-ynyl-1,2,3,4,4a,9,...)
Show SMILES CC#C[C@@]1(O)CC[C@]2(CC=C)[C@H](CCc3cc(O)ccc23)C1 |r|
Show InChI InChI=1S/C20H24O2/c1-3-9-19(22)11-12-20(10-4-2)16(14-19)6-5-15-13-17(21)7-8-18(15)20/h4,7-8,13,16,21-22H,2,5-6,10-12,14H2,1H3/t16-,19-,20-/m1/s1
n/an/a 1.10E+3n/an/an/an/an/an/a
Pfizer Global Research & Development
Curated by ChEMBL
Assay Description
Binding affinity to human progesterone receptor
J Med Chem 52: 1731-43 (2009)
Article DOI: 10.1021/jm801512v
BindingDB Entry DOI: 10.7270/Q23778M0
Glucocorticoid receptor
(Homo sapiens (Human))
BDBM50276168
((2R,4aR,10aR)-4a-Allyl-2-prop-1-ynyl-1,2,3,4,4a,9,...)
Show SMILES CC#C[C@@]1(O)CC[C@]2(CC=C)[C@H](CCc3cc(O)ccc23)C1 |r|
Show InChI InChI=1S/C20H24O2/c1-3-9-19(22)11-12-20(10-4-2)16(14-19)6-5-15-13-17(21)7-8-18(15)20/h4,7-8,13,16,21-22H,2,5-6,10-12,14H2,1H3/t16-,19-,20-/m1/s1
n/an/a 6.20n/an/an/an/an/an/a
Pfizer Global Research & Development
Curated by ChEMBL
Assay Description
Binding affinity to human glucocorticoid receptor
J Med Chem 52: 1731-43 (2009)
Article DOI: 10.1021/jm801512v
BindingDB Entry DOI: 10.7270/Q23778M0
Glucocorticoid receptor
(Homo sapiens (Human))
BDBM50276168
((2R,4aR,10aR)-4a-Allyl-2-prop-1-ynyl-1,2,3,4,4a,9,...)
Show SMILES CC#C[C@@]1(O)CC[C@]2(CC=C)[C@H](CCc3cc(O)ccc23)C1 |r|
Show InChI InChI=1S/C20H24O2/c1-3-9-19(22)11-12-20(10-4-2)16(14-19)6-5-15-13-17(21)7-8-18(15)20/h4,7-8,13,16,21-22H,2,5-6,10-12,14H2,1H3/t16-,19-,20-/m1/s1
n/an/a 14n/an/an/an/an/an/a
Pfizer Global Research & Development
Curated by ChEMBL
Assay Description
Transrepression activity at GR in human SW1353 cells assessed as inhibition of IL1-stimulated MMP13 production after 24 hrs by whole cell ELISA
J Med Chem 52: 1731-43 (2009)
Article DOI: 10.1021/jm801512v
BindingDB Entry DOI: 10.7270/Q23778M0