BDBM50276279 CHEMBL511439::Carbamic acid (4E,6Z,10E)-(8S,9S,12S,13R,14S,16R)-13,19-dihydroxy-8,14-dimethoxy-4,10,12,16-tetramethyl-3-oxo-2-aza-bicyclo[16.3.1]docosa-1(22),4,6,10,18,20-hexaen-9-yl ester
SMILES: CO[C@H]1C[C@H](C)Cc2cc(NC(=O)C(C)=CC=C[C@H](OC)[C@@H](OC(N)=O)\C(C)=C\[C@H](C)[C@H]1O)ccc2O
InChI Key: InChIKey=FOTHSRVGKSQOSD-NPMNMWLJSA-N
Data: 1 Kd
Activity Spreadsheet -- Enzyme Inhibition Constant Data from BindingDB
Found 1 hit for monomerid = 50276279
Trg + Lig
Ki
nM
ΔG°
kcal/mole
IC50
nM
Kd
nM
EC50/IC50
nM
koff
s-1
kon
M-1s-1
pHTemp
°C
Heat shock protein HSP 90-alpha
(Homo sapiens (Human))
BDBM50276279
(CHEMBL511439 | Carbamic acid (4E,6Z,10E)-(8S,9S,12...)
Show SMILES CO[C@H]1C[C@H](C)Cc2cc(NC(=O)C(C)=CC=C[C@H](OC)[C@@H](OC(N)=O)\C(C)=C\[C@H](C)[C@H]1O)ccc2O |r,w:15.15,t:27|
Show InChI InChI=1S/C28H40N2O7/c1-16-12-20-15-21(10-11-22(20)31)30-27(33)17(2)8-7-9-23(35-5)26(37-28(29)34)19(4)14-18(3)25(32)24(13-16)36-6/h7-11,14-16,18,23-26,31-32H,12-13H2,1-6H3,(H2,29,34)(H,30,33)/b9-7?,17-8?,19-14+/t16-,18+,23+,24+,25-,26+/m1/s1
NCI pathway
Reactome pathway
n/an/an/a 2.5n/an/an/an/an/a
Kosan Biosciences Inc
Curated by ChEMBL
Assay Description
Binding affinity to human recombinant Hsp90alpha N-terminal domain by isothermal titration calorimetry
J Med Chem 52: 1518-21 (2009)
Article DOI: 10.1021/jm900012a
BindingDB Entry DOI: 10.7270/Q2QN67Q8