BDBM50276593 CHEMBL462311::trans-2-(Aminoethyl)-5-(2'-methoxy-5'-fluorophenethyl)tetrahydrofuran
SMILES: COc1ccc(F)cc1CC[C@H]1CC[C@H](CCN)O1
InChI Key: InChIKey=FOEJRTWJHDIANT-UONOGXRCSA-N
Data: 3 KI  3 IC50
Activity Spreadsheet -- Enzyme Inhibition Constant Data from BindingDB
Found 6 hits for monomerid = 50276593
Trg + Lig
Ki
nM
ΔG°
kcal/mole
IC50
nM
Kd
nM
EC50/IC50
nM
koff
s-1
kon
M-1s-1
pHTemp
°C
Sodium-dependent serotonin transporter
(Homo sapiens (Human))
BDBM50276593
(CHEMBL462311 | trans-2-(Aminoethyl)-5-(2'-methoxy-...)
Show SMILES COc1ccc(F)cc1CC[C@H]1CC[C@H](CCN)O1 |r|
Show InChI InChI=1S/C15H22FNO2/c1-18-15-7-3-12(16)10-11(15)2-4-13-5-6-14(19-13)8-9-17/h3,7,10,13-14H,2,4-6,8-9,17H2,1H3/t13-,14+/m0/s1
2.10n/an/an/an/an/an/an/an/a
Human BioMolecular Research Institute
Curated by ChEMBL
Assay Description
Displacement of [125I]RTI55 from human SERT expressed in HEK cells
Bioorg Med Chem 17: 2047-68 (2009)
Article DOI: 10.1016/j.bmc.2009.01.023
BindingDB Entry DOI: 10.7270/Q2057GV0
Sodium-dependent noradrenaline transporter
(Homo sapiens (Human))
BDBM50276593
(CHEMBL462311 | trans-2-(Aminoethyl)-5-(2'-methoxy-...)
Show SMILES COc1ccc(F)cc1CC[C@H]1CC[C@H](CCN)O1 |r|
Show InChI InChI=1S/C15H22FNO2/c1-18-15-7-3-12(16)10-11(15)2-4-13-5-6-14(19-13)8-9-17/h3,7,10,13-14H,2,4-6,8-9,17H2,1H3/t13-,14+/m0/s1
Reactome pathway
2.44E+3n/an/an/an/an/an/an/an/a
Human BioMolecular Research Institute
Curated by ChEMBL
Assay Description
Displacement of [125I]RTI55 from human NET expressed in HEK cells
Bioorg Med Chem 17: 2047-68 (2009)
Article DOI: 10.1016/j.bmc.2009.01.023
BindingDB Entry DOI: 10.7270/Q2057GV0
Sodium-dependent dopamine transporter
(Homo sapiens (Human))
BDBM50276593
(CHEMBL462311 | trans-2-(Aminoethyl)-5-(2'-methoxy-...)
Show SMILES COc1ccc(F)cc1CC[C@H]1CC[C@H](CCN)O1 |r|
Show InChI InChI=1S/C15H22FNO2/c1-18-15-7-3-12(16)10-11(15)2-4-13-5-6-14(19-13)8-9-17/h3,7,10,13-14H,2,4-6,8-9,17H2,1H3/t13-,14+/m0/s1
NCI pathway
Reactome pathway
6.50E+3n/an/an/an/an/an/an/an/a
Human BioMolecular Research Institute
Curated by ChEMBL
Assay Description
Displacement of [125I]RTI55 from human DAT expressed in HEK cells
Bioorg Med Chem 17: 2047-68 (2009)
Article DOI: 10.1016/j.bmc.2009.01.023
BindingDB Entry DOI: 10.7270/Q2057GV0
Sodium-dependent noradrenaline transporter
(Homo sapiens (Human))
BDBM50276593
(CHEMBL462311 | trans-2-(Aminoethyl)-5-(2'-methoxy-...)
Show SMILES COc1ccc(F)cc1CC[C@H]1CC[C@H](CCN)O1 |r|
Show InChI InChI=1S/C15H22FNO2/c1-18-15-7-3-12(16)10-11(15)2-4-13-5-6-14(19-13)8-9-17/h3,7,10,13-14H,2,4-6,8-9,17H2,1H3/t13-,14+/m0/s1
Reactome pathway
n/an/a 481n/an/an/an/an/an/a
Human BioMolecular Research Institute
Curated by ChEMBL
Assay Description
Inhibition of [3H]norepinephrine reuptake at human NET expressed in HEK cells
Bioorg Med Chem 17: 2047-68 (2009)
Article DOI: 10.1016/j.bmc.2009.01.023
BindingDB Entry DOI: 10.7270/Q2057GV0
Sodium-dependent dopamine transporter
(Homo sapiens (Human))
BDBM50276593
(CHEMBL462311 | trans-2-(Aminoethyl)-5-(2'-methoxy-...)
Show SMILES COc1ccc(F)cc1CC[C@H]1CC[C@H](CCN)O1 |r|
Show InChI InChI=1S/C15H22FNO2/c1-18-15-7-3-12(16)10-11(15)2-4-13-5-6-14(19-13)8-9-17/h3,7,10,13-14H,2,4-6,8-9,17H2,1H3/t13-,14+/m0/s1
NCI pathway
Reactome pathway
n/an/a 2.79E+4n/an/an/an/an/an/a
Human BioMolecular Research Institute
Curated by ChEMBL
Assay Description
Inhibition of [3H]dopamine reuptake at human DAT expressed in HEK cells
Bioorg Med Chem 17: 2047-68 (2009)
Article DOI: 10.1016/j.bmc.2009.01.023
BindingDB Entry DOI: 10.7270/Q2057GV0
Sodium-dependent serotonin transporter
(Homo sapiens (Human))
BDBM50276593
(CHEMBL462311 | trans-2-(Aminoethyl)-5-(2'-methoxy-...)
Show SMILES COc1ccc(F)cc1CC[C@H]1CC[C@H](CCN)O1 |r|
Show InChI InChI=1S/C15H22FNO2/c1-18-15-7-3-12(16)10-11(15)2-4-13-5-6-14(19-13)8-9-17/h3,7,10,13-14H,2,4-6,8-9,17H2,1H3/t13-,14+/m0/s1
n/an/a 2.5n/an/an/an/an/an/a
Human BioMolecular Research Institute
Curated by ChEMBL
Assay Description
Inhibition of [3H]serotonin reuptake at human SERT expressed in HEK cells
Bioorg Med Chem 17: 2047-68 (2009)
Article DOI: 10.1016/j.bmc.2009.01.023
BindingDB Entry DOI: 10.7270/Q2057GV0