BDBM50276645 2-Aminoethyl-5-(3'-(2''-methoxy-5''-fluorophenyl)-1'-butyl)tetrahydrofuran::CHEMBL460204
SMILES: COc1ccc(F)cc1CCCCC1CCC(CCN)O1
InChI Key: InChIKey=KJRMGZKFHBXRRA-UHFFFAOYSA-N
Data: 3 KI  3 IC50
Activity Spreadsheet -- Enzyme Inhibition Constant Data from BindingDB
Found 6 hits for monomerid = 50276645
Trg + Lig
Ki
nM
ΔG°
kcal/mole
IC50
nM
Kd
nM
EC50/IC50
nM
koff
s-1
kon
M-1s-1
pHTemp
°C
Sodium-dependent serotonin transporter
(Homo sapiens (Human))
BDBM50276645
(2-Aminoethyl-5-(3'-(2''-methoxy-5''-fluorophenyl)-...)
Show SMILES COc1ccc(F)cc1CCCCC1CCC(CCN)O1
Show InChI InChI=1S/C17H26FNO2/c1-20-17-9-6-14(18)12-13(17)4-2-3-5-15-7-8-16(21-15)10-11-19/h6,9,12,15-16H,2-5,7-8,10-11,19H2,1H3
2n/an/an/an/an/an/an/an/a
Human BioMolecular Research Institute
Curated by ChEMBL
Assay Description
Displacement of [125I]RTI55 from human SERT expressed in HEK cells
Bioorg Med Chem 17: 2047-68 (2009)
Article DOI: 10.1016/j.bmc.2009.01.023
BindingDB Entry DOI: 10.7270/Q2057GV0
Sodium-dependent dopamine transporter
(Homo sapiens (Human))
BDBM50276645
(2-Aminoethyl-5-(3'-(2''-methoxy-5''-fluorophenyl)-...)
Show SMILES COc1ccc(F)cc1CCCCC1CCC(CCN)O1
Show InChI InChI=1S/C17H26FNO2/c1-20-17-9-6-14(18)12-13(17)4-2-3-5-15-7-8-16(21-15)10-11-19/h6,9,12,15-16H,2-5,7-8,10-11,19H2,1H3
NCI pathway
Reactome pathway
3.39E+3n/an/an/an/an/an/an/an/a
Human BioMolecular Research Institute
Curated by ChEMBL
Assay Description
Displacement of [125I]RTI55 from human DAT expressed in HEK cells
Bioorg Med Chem 17: 2047-68 (2009)
Article DOI: 10.1016/j.bmc.2009.01.023
BindingDB Entry DOI: 10.7270/Q2057GV0
Sodium-dependent noradrenaline transporter
(Homo sapiens (Human))
BDBM50276645
(2-Aminoethyl-5-(3'-(2''-methoxy-5''-fluorophenyl)-...)
Show SMILES COc1ccc(F)cc1CCCCC1CCC(CCN)O1
Show InChI InChI=1S/C17H26FNO2/c1-20-17-9-6-14(18)12-13(17)4-2-3-5-15-7-8-16(21-15)10-11-19/h6,9,12,15-16H,2-5,7-8,10-11,19H2,1H3
Reactome pathway
4.06E+3n/an/an/an/an/an/an/an/a
Human BioMolecular Research Institute
Curated by ChEMBL
Assay Description
Displacement of [125I]RTI55 from human NET expressed in HEK cells
Bioorg Med Chem 17: 2047-68 (2009)
Article DOI: 10.1016/j.bmc.2009.01.023
BindingDB Entry DOI: 10.7270/Q2057GV0
Sodium-dependent dopamine transporter
(Homo sapiens (Human))
BDBM50276645
(2-Aminoethyl-5-(3'-(2''-methoxy-5''-fluorophenyl)-...)
Show SMILES COc1ccc(F)cc1CCCCC1CCC(CCN)O1
Show InChI InChI=1S/C17H26FNO2/c1-20-17-9-6-14(18)12-13(17)4-2-3-5-15-7-8-16(21-15)10-11-19/h6,9,12,15-16H,2-5,7-8,10-11,19H2,1H3
NCI pathway
Reactome pathway
n/an/a 3.75E+4n/an/an/an/an/an/a
Human BioMolecular Research Institute
Curated by ChEMBL
Assay Description
Inhibition of [3H]dopamine reuptake at human DAT expressed in HEK cells
Bioorg Med Chem 17: 2047-68 (2009)
Article DOI: 10.1016/j.bmc.2009.01.023
BindingDB Entry DOI: 10.7270/Q2057GV0
Sodium-dependent serotonin transporter
(Homo sapiens (Human))
BDBM50276645
(2-Aminoethyl-5-(3'-(2''-methoxy-5''-fluorophenyl)-...)
Show SMILES COc1ccc(F)cc1CCCCC1CCC(CCN)O1
Show InChI InChI=1S/C17H26FNO2/c1-20-17-9-6-14(18)12-13(17)4-2-3-5-15-7-8-16(21-15)10-11-19/h6,9,12,15-16H,2-5,7-8,10-11,19H2,1H3
n/an/a 31n/an/an/an/an/an/a
Human BioMolecular Research Institute
Curated by ChEMBL
Assay Description
Inhibition of [3H]serotonin reuptake at human SERT expressed in HEK cells
Bioorg Med Chem 17: 2047-68 (2009)
Article DOI: 10.1016/j.bmc.2009.01.023
BindingDB Entry DOI: 10.7270/Q2057GV0
Sodium-dependent noradrenaline transporter
(Homo sapiens (Human))
BDBM50276645
(2-Aminoethyl-5-(3'-(2''-methoxy-5''-fluorophenyl)-...)
Show SMILES COc1ccc(F)cc1CCCCC1CCC(CCN)O1
Show InChI InChI=1S/C17H26FNO2/c1-20-17-9-6-14(18)12-13(17)4-2-3-5-15-7-8-16(21-15)10-11-19/h6,9,12,15-16H,2-5,7-8,10-11,19H2,1H3
Reactome pathway
n/an/a 8.53E+3n/an/an/an/an/an/a
Human BioMolecular Research Institute
Curated by ChEMBL
Assay Description
Inhibition of [3H]norepinephrine reuptake at human NET expressed in HEK cells
Bioorg Med Chem 17: 2047-68 (2009)
Article DOI: 10.1016/j.bmc.2009.01.023
BindingDB Entry DOI: 10.7270/Q2057GV0