BDBM50276672 (4-(3-benzhydryl-3,8-diazabicyclo[3.2.1]octan-8-yl)piperidin-1-yl)(2,4-dimethylpyridin-3-yl)methanone::CHEMBL514749
SMILES: Cc1ccnc(C)c1C(=O)N1CCC(CC1)N1C2CCC1CN(C2)C(c1ccccc1)c1ccccc1
InChI Key: InChIKey=WPATYPNXFWWASD-UHFFFAOYSA-N
Data: 1 IC50
Activity Spreadsheet -- Enzyme Inhibition Constant Data from BindingDB
Found 1 hit for monomerid = 50276672
Trg + Lig
Ki
nM
ΔG°
kcal/mole
IC50
nM
Kd
nM
EC50/IC50
nM
koff
s-1
kon
M-1s-1
pHTemp
°C
C-C chemokine receptor type 5
(Homo sapiens (Human))
BDBM50276672
((4-(3-benzhydryl-3,8-diazabicyclo[3.2.1]octan-8-yl...)
Show SMILES Cc1ccnc(C)c1C(=O)N1CCC(CC1)N1C2CCC1CN(C2)C(c1ccccc1)c1ccccc1
Show InChI InChI=1S/C32H38N4O/c1-23-15-18-33-24(2)30(23)32(37)34-19-16-27(17-20-34)36-28-13-14-29(36)22-35(21-28)31(25-9-5-3-6-10-25)26-11-7-4-8-12-26/h3-12,15,18,27-29,31H,13-14,16-17,19-22H2,1-2H3
n/an/a 41n/an/an/an/an/an/a
Pfizer Global Research and Development
Curated by ChEMBL
Assay Description
Antagonist activity at human recombinant CCR5 expressed in human HeLa-P4 cells assessed as inhibition of human HeLa-P4 cells binding to HIV1 gp160 ex...
Bioorg Med Chem Lett 19: 1084-8 (2009)
Article DOI: 10.1016/j.bmcl.2009.01.012
BindingDB Entry DOI: 10.7270/Q2W095SG