null
SMILES: OCCCNc1nccc(n1)C1CCCN(CCc2c[nH]c3ccccc23)C1
InChI Key: InChIKey=ICPZFNKFNRZFTD-UHFFFAOYSA-N
Activity Spreadsheet -- Enzyme Inhibition Constant Data from BindingDB
Found 2 hits for monomerid = 50277250
Trg + Lig
Ki
nM
ΔG°
kcal/mole
IC50
nM
Kd
nM
EC50/IC50
nM
koff
s-1
kon
M-1s-1
pHTemp
°C
5-hydroxytryptamine receptor 1A
(Homo sapiens (Human))
BDBM50277250
(3-(4-(1-(2-(1H-indol-3-yl)ethyl)piperidin-3-yl)pyr...)
Show SMILES OCCCNc1nccc(n1)C1CCCN(CCc2c[nH]c3ccccc23)C1
Show InChI InChI=1S/C22H29N5O/c28-14-4-10-23-22-24-11-8-20(26-22)18-5-3-12-27(16-18)13-9-17-15-25-21-7-2-1-6-19(17)21/h1-2,6-8,11,15,18,25,28H,3-5,9-10,12-14,16H2,(H,23,24,26)
175n/an/an/an/an/an/an/an/a
Pfizer Global Research and Development
Curated by ChEMBL
Assay Description
Displacement of [3H]8-OH-DPAT from human 5HT1A receptor
Bioorg Med Chem Lett 19: 1159-63 (2009)
Article DOI: 10.1016/j.bmcl.2008.12.087
BindingDB Entry DOI: 10.7270/Q29886VW
5-hydroxytryptamine receptor 1A
(Homo sapiens (Human))
BDBM50277250
(3-(4-(1-(2-(1H-indol-3-yl)ethyl)piperidin-3-yl)pyr...)
Show SMILES OCCCNc1nccc(n1)C1CCCN(CCc2c[nH]c3ccccc23)C1
Show InChI InChI=1S/C22H29N5O/c28-14-4-10-23-22-24-11-8-20(26-22)18-5-3-12-27(16-18)13-9-17-15-25-21-7-2-1-6-19(17)21/h1-2,6-8,11,15,18,25,28H,3-5,9-10,12-14,16H2,(H,23,24,26)
n/an/an/an/a 51.4n/an/an/an/a
Pfizer Global Research and Development
Curated by ChEMBL
Assay Description
Agonist activity at human 5HT1A receptor expressed in CHO cells by FLIPR
Bioorg Med Chem Lett 19: 1159-63 (2009)
Article DOI: 10.1016/j.bmcl.2008.12.087
BindingDB Entry DOI: 10.7270/Q29886VW