BDBM50277714 2-(3-(7-hydroxy-4,5-dihydronaphtho[2,1-d]isoxazol-3-yl)propanamido)cyclohex-1-enecarboxylic acid::CHEMBL485196
SMILES: OC(=O)C1=C(CCCC1)NC(=O)CCc1noc-2c1CCc1cc(O)ccc-21
InChI Key: InChIKey=CEEDKNHIBNHBQW-UHFFFAOYSA-N
Data: 3 IC50  1 EC50
Activity Spreadsheet -- Enzyme Inhibition Constant Data from BindingDB
Found 4 hits for monomerid = 50277714
Trg + Lig
Ki
nM
ΔG°
kcal/mole
IC50
nM
Kd
nM
EC50/IC50
nM
koff
s-1
kon
M-1s-1
pHTemp
°C
Cytochrome P450 2C8
(Homo sapiens (Human))
BDBM50277714
(2-(3-(7-hydroxy-4,5-dihydronaphtho[2,1-d]isoxazol-...)
Show SMILES OC(=O)C1=C(CCCC1)NC(=O)CCc1noc-2c1CCc1cc(O)ccc-21 |t:3|
Show InChI InChI=1S/C21H22N2O5/c24-13-6-8-14-12(11-13)5-7-15-18(23-28-20(14)15)9-10-19(25)22-17-4-2-1-3-16(17)21(26)27/h6,8,11,24H,1-5,7,9-10H2,(H,22,25)(H,26,27)
n/an/a 4.40E+4n/an/an/an/an/an/a
Merck Research Laboratories
Curated by ChEMBL
Assay Description
Inhibition of CYP2C8 in human liver microsomes using montelukast substrate
J Med Chem 52: 2587-602 (2009)
Article DOI: 10.1021/jm900151e
BindingDB Entry DOI: 10.7270/Q2RJ4JDG
Hydroxycarboxylic acid receptor 2
(Homo sapiens (Human))
BDBM50277714
(2-(3-(7-hydroxy-4,5-dihydronaphtho[2,1-d]isoxazol-...)
Show SMILES OC(=O)C1=C(CCCC1)NC(=O)CCc1noc-2c1CCc1cc(O)ccc-21 |t:3|
Show InChI InChI=1S/C21H22N2O5/c24-13-6-8-14-12(11-13)5-7-15-18(23-28-20(14)15)9-10-19(25)22-17-4-2-1-3-16(17)21(26)27/h6,8,11,24H,1-5,7,9-10H2,(H,22,25)(H,26,27)
Reactome pathway
n/an/an/an/a 19n/an/an/an/a
Merck Research Laboratories
Curated by ChEMBL
Assay Description
Agonist activity at human GPR109A expressed in CHOK1 cells by [35S]GTPgammaS binding assay
J Med Chem 52: 2587-602 (2009)
Article DOI: 10.1021/jm900151e
BindingDB Entry DOI: 10.7270/Q2RJ4JDG
Hydroxycarboxylic acid receptor 2
(Homo sapiens (Human))
BDBM50277714
(2-(3-(7-hydroxy-4,5-dihydronaphtho[2,1-d]isoxazol-...)
Show SMILES OC(=O)C1=C(CCCC1)NC(=O)CCc1noc-2c1CCc1cc(O)ccc-21 |t:3|
Show InChI InChI=1S/C21H22N2O5/c24-13-6-8-14-12(11-13)5-7-15-18(23-28-20(14)15)9-10-19(25)22-17-4-2-1-3-16(17)21(26)27/h6,8,11,24H,1-5,7,9-10H2,(H,22,25)(H,26,27)
Reactome pathway
n/an/a 4n/an/an/an/an/an/a
Merck Research Laboratories
Curated by ChEMBL
Assay Description
Displacement of [3H]niacin from human GPR109A expressed in CHO cells
J Med Chem 52: 2587-602 (2009)
Article DOI: 10.1021/jm900151e
BindingDB Entry DOI: 10.7270/Q2RJ4JDG
Cytochrome P450 2C9
(Homo sapiens (Human))
BDBM50277714
(2-(3-(7-hydroxy-4,5-dihydronaphtho[2,1-d]isoxazol-...)
Show SMILES OC(=O)C1=C(CCCC1)NC(=O)CCc1noc-2c1CCc1cc(O)ccc-21 |t:3|
Show InChI InChI=1S/C21H22N2O5/c24-13-6-8-14-12(11-13)5-7-15-18(23-28-20(14)15)9-10-19(25)22-17-4-2-1-3-16(17)21(26)27/h6,8,11,24H,1-5,7,9-10H2,(H,22,25)(H,26,27)
Reactome pathway
n/an/a 1.10E+4n/an/an/an/an/an/a
Merck Research Laboratories
Curated by ChEMBL
Assay Description
Inhibition of CYP2C9 in human liver microsomes using diclofenac substrate
J Med Chem 52: 2587-602 (2009)
Article DOI: 10.1021/jm900151e
BindingDB Entry DOI: 10.7270/Q2RJ4JDG