BDBM50277779 CHEMBL484003::N-((S)-3-methoxy-1-((S)-3-methoxy-1-((S)-1-((R)-2-methyloxiran-2-yl)-1-oxo-3-phenylpropan-2-ylamino)-1-oxopropan-2-ylamino)-1-oxopropan-2-yl)-5-methylisoxazole-3-carboxamide
SMILES: COC[C@H](NC(=O)[C@H](COC)NC(=O)c1cc(C)on1)C(=O)N[C@@H](Cc1ccccc1)C(=O)[C@@]1(C)CO1
InChI Key: InChIKey=LEMFZBFJRLSSKX-YMGHSFPGSA-N
Data: 1 IC50
Activity Spreadsheet -- Enzyme Inhibition Constant Data from BindingDB
Found 1 hit for monomerid = 50277779
Trg + Lig
Ki
nM
ΔG°
kcal/mole
IC50
nM
Kd
nM
EC50/IC50
nM
koff
s-1
kon
M-1s-1
pHTemp
°C
26S proteosome
(Homo sapiens (Human))
BDBM50277779
(CHEMBL484003 | N-((S)-3-methoxy-1-((S)-3-methoxy-1...)
Show SMILES COC[C@H](NC(=O)[C@H](COC)NC(=O)c1cc(C)on1)C(=O)N[C@@H](Cc1ccccc1)C(=O)[C@@]1(C)CO1 |r|
Show InChI InChI=1S/C25H32N4O8/c1-15-10-18(29-37-15)22(31)27-20(13-35-4)24(33)28-19(12-34-3)23(32)26-17(21(30)25(2)14-36-25)11-16-8-6-5-7-9-16/h5-10,17,19-20H,11-14H2,1-4H3,(H,26,32)(H,27,31)(H,28,33)/t17-,19-,20-,25+/m0/s1
Reactome pathway
n/an/a 21n/an/an/an/an/an/a
Proteolix, Inc.
Curated by ChEMBL
Assay Description
Inhibition of chymotrypsin-like activity of LMP7 immunoproteasome by proteasome active site ELISA
J Med Chem 52: 3028-38 (2009)
Article DOI: 10.1021/jm801329v
BindingDB Entry DOI: 10.7270/Q2ZW1KS0