BDBM50277781 (2S)-2-[(2S)-2-[(5-ethoxy-1,2-oxazol-3-yl)formamido]-3-methoxypropanamido]-3-methoxy-N-[(2S)-1-[(2R)-2-methyloxiran-2-yl]-1-oxo-3-phenylpropan-2-yl]propanamide::CHEMBL489864
SMILES: CCOc1cc(no1)C(=O)N[C@@H](COC)C(=O)N[C@@H](COC)C(=O)N[C@@H](Cc1ccccc1)C(=O)[C@@]1(C)CO1
InChI Key: InChIKey=VWQJDKOLBFDKEY-USVZDYLCSA-N
Data: 1 IC50
Activity Spreadsheet -- Enzyme Inhibition Constant Data from BindingDB
Found 1 hit for monomerid = 50277781
Trg + Lig
Ki
nM
ΔG°
kcal/mole
IC50
nM
Kd
nM
EC50/IC50
nM
koff
s-1
kon
M-1s-1
pHTemp
°C
26S proteosome
(Homo sapiens (Human))
BDBM50277781
((2S)-2-[(2S)-2-[(5-ethoxy-1,2-oxazol-3-yl)formamid...)
Show SMILES CCOc1cc(no1)C(=O)N[C@@H](COC)C(=O)N[C@@H](COC)C(=O)N[C@@H](Cc1ccccc1)C(=O)[C@@]1(C)CO1 |r|
Show InChI InChI=1S/C26H34N4O9/c1-5-37-21-12-18(30-39-21)23(32)28-20(14-36-4)25(34)29-19(13-35-3)24(33)27-17(22(31)26(2)15-38-26)11-16-9-7-6-8-10-16/h6-10,12,17,19-20H,5,11,13-15H2,1-4H3,(H,27,33)(H,28,32)(H,29,34)/t17-,19-,20-,26+/m0/s1
Reactome pathway
n/an/a 5n/an/an/an/an/an/a
Proteolix, Inc.
Curated by ChEMBL
Assay Description
Inhibition of chymotrypsin-like activity of LMP7 immunoproteasome by proteasome active site ELISA
J Med Chem 52: 3028-38 (2009)
Article DOI: 10.1021/jm801329v
BindingDB Entry DOI: 10.7270/Q2ZW1KS0