BDBM50277788 5-(3-fluorophenyl)-3-(1H-tetrazol-5-yl)-1,4,5,6-tetrahydrocyclopenta[c]pyrazole::CHEMBL519966
SMILES: Fc1cccc(c1)C1Cc2[nH]nc(c2C1)-c1nnn[nH]1
InChI Key: InChIKey=KHKNCBRCIAXEGH-UHFFFAOYSA-N
Data: 2 IC50
Activity Spreadsheet -- Enzyme Inhibition Constant Data from BindingDB
Found 2 hits for monomerid = 50277788
Trg + Lig
Ki
nM
ΔG°
kcal/mole
IC50
nM
Kd
nM
EC50/IC50
nM
koff
s-1
kon
M-1s-1
pHTemp
°C
Hydroxycarboxylic acid receptor 2
(Mus musculus)
BDBM50277788
(5-(3-fluorophenyl)-3-(1H-tetrazol-5-yl)-1,4,5,6-te...)
Show SMILES Fc1cccc(c1)C1Cc2[nH]nc(c2C1)-c1nnn[nH]1
Show InChI InChI=1S/C13H11FN6/c14-9-3-1-2-7(4-9)8-5-10-11(6-8)15-16-12(10)13-17-19-20-18-13/h1-4,8H,5-6H2,(H,15,16)(H,17,18,19,20)
Reactome pathway
n/an/a 80n/an/an/an/an/an/a
Merck Research Laboratories
Curated by ChEMBL
Assay Description
Displacement of [3H]nicotinic acid from mouse GPR109a receptor
Bioorg Med Chem Lett 19: 2121-4 (2009)
Article DOI: 10.1016/j.bmcl.2009.03.014
BindingDB Entry DOI: 10.7270/Q2G161RV
Hydroxycarboxylic acid receptor 2
(Homo sapiens (Human))
BDBM50277788
(5-(3-fluorophenyl)-3-(1H-tetrazol-5-yl)-1,4,5,6-te...)
Show SMILES Fc1cccc(c1)C1Cc2[nH]nc(c2C1)-c1nnn[nH]1
Show InChI InChI=1S/C13H11FN6/c14-9-3-1-2-7(4-9)8-5-10-11(6-8)15-16-12(10)13-17-19-20-18-13/h1-4,8H,5-6H2,(H,15,16)(H,17,18,19,20)
Reactome pathway
n/an/a 140n/an/an/an/an/an/a
Merck Research Laboratories
Curated by ChEMBL
Assay Description
Displacement of [3H]nicotinic acid from human GPR109a receptor
Bioorg Med Chem Lett 19: 2121-4 (2009)
Article DOI: 10.1016/j.bmcl.2009.03.014
BindingDB Entry DOI: 10.7270/Q2G161RV