BDBM50277862 2-methoxy-3-(4-(2-(5-methyl-2-o-tolyloxazol-4-yl)ethoxy)naphthalen-1-yl)propanoic acid::CHEMBL483351
SMILES: COC(Cc1ccc(OCCc2nc(oc2C)-c2ccccc2C)c2ccccc12)C(O)=O
InChI Key: InChIKey=MFISYCAZXGRLHH-UHFFFAOYSA-N
Data: 2 IC50  2 EC50
Activity Spreadsheet -- Enzyme Inhibition Constant Data from BindingDB
Found 4 hits for monomerid = 50277862
Trg + Lig
Ki
nM
ΔG°
kcal/mole
IC50
nM
Kd
nM
EC50/IC50
nM
koff
s-1
kon
M-1s-1
pHTemp
°C
Peroxisome proliferator-activated receptor alpha (PPAR alpha)
(Homo sapiens (Human))
BDBM50277862
(2-methoxy-3-(4-(2-(5-methyl-2-o-tolyloxazol-4-yl)e...)
Show SMILES COC(Cc1ccc(OCCc2nc(oc2C)-c2ccccc2C)c2ccccc12)C(O)=O
Show InChI InChI=1S/C27H27NO5/c1-17-8-4-5-9-20(17)26-28-23(18(2)33-26)14-15-32-24-13-12-19(16-25(31-3)27(29)30)21-10-6-7-11-22(21)24/h4-13,25H,14-16H2,1-3H3,(H,29,30)
n/an/a 432n/an/an/an/an/an/a
F. Hoffmann-La Roche Ltd
Curated by ChEMBL
Assay Description
Displacement of radio labeled 2(S)-(2-benzoyl-phenylamino)-3-{4-[1,1-ditritio-2-(5-methyl-2-phenyl-oxazol-4-yl)-ethoxy]-phenyl}-propionic acid from G...
Bioorg Med Chem Lett 19: 2468-73 (2009)
Article DOI: 10.1016/j.bmcl.2009.03.036
BindingDB Entry DOI: 10.7270/Q2QC03C3
Peroxisome proliferator-activated receptor
(Homo sapiens (Human))
BDBM50277862
(2-methoxy-3-(4-(2-(5-methyl-2-o-tolyloxazol-4-yl)e...)
Show SMILES COC(Cc1ccc(OCCc2nc(oc2C)-c2ccccc2C)c2ccccc12)C(O)=O
Show InChI InChI=1S/C27H27NO5/c1-17-8-4-5-9-20(17)26-28-23(18(2)33-26)14-15-32-24-13-12-19(16-25(31-3)27(29)30)21-10-6-7-11-22(21)24/h4-13,25H,14-16H2,1-3H3,(H,29,30)
NCI pathway
Reactome pathway
n/an/an/an/a 716n/an/an/an/a
F. Hoffmann-La Roche Ltd
Curated by ChEMBL
Assay Description
Agonist activity at human PPARgamma expressed in BHK21 cells assessed as SEAP activity by luciferase reporter transactivation assay
Bioorg Med Chem Lett 19: 2468-73 (2009)
Article DOI: 10.1016/j.bmcl.2009.03.036
BindingDB Entry DOI: 10.7270/Q2QC03C3
Peroxisome proliferator-activated receptor alpha (PPAR alpha)
(Homo sapiens (Human))
BDBM50277862
(2-methoxy-3-(4-(2-(5-methyl-2-o-tolyloxazol-4-yl)e...)
Show SMILES COC(Cc1ccc(OCCc2nc(oc2C)-c2ccccc2C)c2ccccc12)C(O)=O
Show InChI InChI=1S/C27H27NO5/c1-17-8-4-5-9-20(17)26-28-23(18(2)33-26)14-15-32-24-13-12-19(16-25(31-3)27(29)30)21-10-6-7-11-22(21)24/h4-13,25H,14-16H2,1-3H3,(H,29,30)
n/an/an/an/a 123n/an/an/an/a
F. Hoffmann-La Roche Ltd
Curated by ChEMBL
Assay Description
Agonist activity at human PPARalpha by luciferase reporter transactivation assay
Bioorg Med Chem Lett 19: 2468-73 (2009)
Article DOI: 10.1016/j.bmcl.2009.03.036
BindingDB Entry DOI: 10.7270/Q2QC03C3
Peroxisome proliferator-activated receptor
(Homo sapiens (Human))
BDBM50277862
(2-methoxy-3-(4-(2-(5-methyl-2-o-tolyloxazol-4-yl)e...)
Show SMILES COC(Cc1ccc(OCCc2nc(oc2C)-c2ccccc2C)c2ccccc12)C(O)=O
Show InChI InChI=1S/C27H27NO5/c1-17-8-4-5-9-20(17)26-28-23(18(2)33-26)14-15-32-24-13-12-19(16-25(31-3)27(29)30)21-10-6-7-11-22(21)24/h4-13,25H,14-16H2,1-3H3,(H,29,30)
NCI pathway
Reactome pathway
n/an/a 802n/an/an/an/an/an/a
F. Hoffmann-La Roche Ltd
Curated by ChEMBL
Assay Description
Displacement of radio labeled 2(S)-(2-benzoyl-phenylamino)-3-{4-[1,1-ditritio-2-(5-methyl-2-phenyl-oxazol-4-yl)-ethoxy]-phenyl}-propionic acid from G...
Bioorg Med Chem Lett 19: 2468-73 (2009)
Article DOI: 10.1016/j.bmcl.2009.03.036
BindingDB Entry DOI: 10.7270/Q2QC03C3