null
SMILES: C[C@@H]1CN(Cc2ccc(cc2)-c2ccc(F)c(Cl)c2)C(=O)O1
InChI Key: InChIKey=RNJMIJHYCDJJMZ-LLVKDONJSA-N
Activity Spreadsheet -- Enzyme Inhibition Constant Data from BindingDB
Found 2 hits for monomerid = 50277955
Trg + Lig
Ki
nM
ΔG°
kcal/mole
IC50
nM
Kd
nM
EC50/IC50
nM
koff
s-1
kon
M-1s-1
pHTemp
°C
5-hydroxytryptamine receptor 2A
(Homo sapiens (Human))
BDBM50277955
((R)-3-((3'-chloro-4'-fluorobiphenyl-4-yl)methyl)-5...)
Show SMILES C[C@@H]1CN(Cc2ccc(cc2)-c2ccc(F)c(Cl)c2)C(=O)O1 |r|
Show InChI InChI=1S/C17H15ClFNO2/c1-11-9-20(17(21)22-11)10-12-2-4-13(5-3-12)14-6-7-16(19)15(18)8-14/h2-8,11H,9-10H2,1H3/t11-/m1/s1
Reactome pathway
2.10E+3n/an/an/an/an/an/an/an/a
Pfizer Global Research and Development
Curated by ChEMBL
Assay Description
Binding affinity to human 5HT2A receptor
Bioorg Med Chem Lett 19: 2524-9 (2009)
Article DOI: 10.1016/j.bmcl.2009.03.032
BindingDB Entry DOI: 10.7270/Q2F18ZK7
Metabotropic glutamate receptor 2
(Homo sapiens (Human))
BDBM50277955
((R)-3-((3'-chloro-4'-fluorobiphenyl-4-yl)methyl)-5...)
Show SMILES C[C@@H]1CN(Cc2ccc(cc2)-c2ccc(F)c(Cl)c2)C(=O)O1 |r|
Show InChI InChI=1S/C17H15ClFNO2/c1-11-9-20(17(21)22-11)10-12-2-4-13(5-3-12)14-6-7-16(19)15(18)8-14/h2-8,11H,9-10H2,1H3/t11-/m1/s1
n/an/an/an/a 30n/an/an/an/a
Pfizer Global Research and Development
Curated by ChEMBL
Assay Description
Agonist activity at mGluR2 (unknown origin) expressed in HEK cells by FLIPR assay in presence of glutamate
Bioorg Med Chem Lett 19: 2524-9 (2009)
Article DOI: 10.1016/j.bmcl.2009.03.032
BindingDB Entry DOI: 10.7270/Q2F18ZK7