BDBM50278250 CHEMBL513255::ethyl hydrogen 4-(2-amino-5-(thiophen-2-yl)phenylcarbamoyl)phenylphosphonate
SMILES: CCOP(O)(=O)c1ccc(cc1)C(=O)Nc1cc(ccc1N)-c1cccs1
InChI Key: InChIKey=IMLZDMUDBWXUHD-UHFFFAOYSA-N
Data: 1 IC50
Activity Spreadsheet -- Enzyme Inhibition Constant Data from BindingDB
Found 1 hit for monomerid = 50278250
Trg + Lig
Ki
nM
ΔG°
kcal/mole
IC50
nM
Kd
nM
EC50/IC50
nM
koff
s-1
kon
M-1s-1
pHTemp
°C
Histone deacetylase 1
(Homo sapiens (Human))
BDBM50278250
(CHEMBL513255 | ethyl hydrogen 4-(2-amino-5-(thioph...)
Show SMILES CCOP(O)(=O)c1ccc(cc1)C(=O)Nc1cc(ccc1N)-c1cccs1
Show InChI InChI=1S/C19H19N2O4PS/c1-2-25-26(23,24)15-8-5-13(6-9-15)19(22)21-17-12-14(7-10-16(17)20)18-4-3-11-27-18/h3-12H,2,20H2,1H3,(H,21,22)(H,23,24)
NCI pathway
Reactome pathway
n/an/a 42n/an/an/an/an/an/a
Merck Research Laboratories
Curated by ChEMBL
Assay Description
Inhibition of HDAC1
Bioorg Med Chem Lett 19: 2053-8 (2009)
Article DOI: 10.1016/j.bmcl.2009.02.009
BindingDB Entry DOI: 10.7270/Q2QV3MDQ