BDBM50278257 2-Benzylbenzo[f]chromen-3-one::CHEMBL513763
SMILES: O=c1oc2ccc3ccccc3c2cc1Cc1ccccc1
InChI Key: InChIKey=OOALWLFUSOVWMV-UHFFFAOYSA-N
Data: 1 KI  1 IC50
Activity Spreadsheet -- Enzyme Inhibition Constant Data from BindingDB
Found 2 hits for monomerid = 50278257
Trg + Lig
Ki
nM
ΔG°
kcal/mole
IC50
nM
Kd
nM
EC50/IC50
nM
koff
s-1
kon
M-1s-1
pHTemp
°C
Cannabinoid receptor 1
(Rattus norvegicus (rat))
BDBM50278257
(2-Benzylbenzo[f]chromen-3-one | CHEMBL513763)
Show SMILES O=c1oc2ccc3ccccc3c2cc1Cc1ccccc1
Show InChI InChI=1S/C20H14O2/c21-20-16(12-14-6-2-1-3-7-14)13-18-17-9-5-4-8-15(17)10-11-19(18)22-20/h1-11,13H,12H2
Reactome pathway
4.19E+3n/an/an/an/an/an/an/an/a
University of Bonn
Curated by ChEMBL
Assay Description
Displacement of [3H]CP-55940 from cannabinoid CB1 receptor in rat brain cortical membrane
Bioorg Med Chem 17: 2842-51 (2009)
Article DOI: 10.1016/j.bmc.2009.02.027
BindingDB Entry DOI: 10.7270/Q23R0TSC
G-protein coupled receptor 55
(Homo sapiens (Human))
BDBM50278257
(2-Benzylbenzo[f]chromen-3-one | CHEMBL513763)
Show SMILES O=c1oc2ccc3ccccc3c2cc1Cc1ccccc1
Show InChI InChI=1S/C20H14O2/c21-20-16(12-14-6-2-1-3-7-14)13-18-17-9-5-4-8-15(17)10-11-19(18)22-20/h1-11,13H,12H2
Reactome pathway
n/an/a 2.81E+3n/an/an/an/an/an/a
University of Bonn
Curated by ChEMBL
Assay Description
Antagonist activity at human GPR55 transfected in CHO cells assessed as inhibition of LPI-induced beta-arrestin recruitment incubated 60 mins prior t...
J Med Chem 56: 4798-810 (2013)
Article DOI: 10.1021/jm4005175
BindingDB Entry DOI: 10.7270/Q2GM88QX