BDBM50278309 CHEMBL471868::methyl 4-(2-amino-5-(thiophen-2-yl)phenylcarbamoyl)phenyl(phenyl)phosphinate
SMILES: COP(=O)(c1ccccc1)c1ccc(cc1)C(=O)Nc1cc(ccc1N)-c1cccs1
InChI Key: InChIKey=KDDZFAMHBWRFCE-UHFFFAOYSA-N
Data: 1 IC50
Activity Spreadsheet -- Enzyme Inhibition Constant Data from BindingDB
Found 1 hit for monomerid = 50278309
Trg + Lig
Ki
nM
ΔG°
kcal/mole
IC50
nM
Kd
nM
EC50/IC50
nM
koff
s-1
kon
M-1s-1
pHTemp
°C
Histone deacetylase 1
(Homo sapiens (Human))
BDBM50278309
(CHEMBL471868 | methyl 4-(2-amino-5-(thiophen-2-yl)...)
Show SMILES COP(=O)(c1ccccc1)c1ccc(cc1)C(=O)Nc1cc(ccc1N)-c1cccs1
Show InChI InChI=1S/C24H21N2O3PS/c1-29-30(28,19-6-3-2-4-7-19)20-12-9-17(10-13-20)24(27)26-22-16-18(11-14-21(22)25)23-8-5-15-31-23/h2-16H,25H2,1H3,(H,26,27)
NCI pathway
Reactome pathway
n/an/a 29n/an/an/an/an/an/a
Merck Research Laboratories
Curated by ChEMBL
Assay Description
Inhibition of HDAC1
Bioorg Med Chem Lett 19: 2053-8 (2009)
Article DOI: 10.1016/j.bmcl.2009.02.009
BindingDB Entry DOI: 10.7270/Q2QV3MDQ