BDBM50278328 3-Benzyl-6-iodochromen-2-one::CHEMBL443168
SMILES: Ic1ccc2oc(=O)c(Cc3ccccc3)cc2c1
InChI Key: InChIKey=QDODXLKHZZZCBV-UHFFFAOYSA-N
Data: 1 KI  1 IC50
Activity Spreadsheet -- Enzyme Inhibition Constant Data from BindingDB
Found 2 hits for monomerid = 50278328
Trg + Lig
Ki
nM
ΔG°
kcal/mole
IC50
nM
Kd
nM
EC50/IC50
nM
koff
s-1
kon
M-1s-1
pHTemp
°C
Cannabinoid receptor 1
(Rattus norvegicus (rat))
BDBM50278328
(3-Benzyl-6-iodochromen-2-one | CHEMBL443168)
Show SMILES Ic1ccc2oc(=O)c(Cc3ccccc3)cc2c1
Show InChI InChI=1S/C16H11IO2/c17-14-6-7-15-12(10-14)9-13(16(18)19-15)8-11-4-2-1-3-5-11/h1-7,9-10H,8H2
Reactome pathway
>1.00E+4n/an/an/an/an/an/an/an/a
University of Bonn
Curated by ChEMBL
Assay Description
Displacement of [3H]CP-55940 from cannabinoid CB1 receptor in rat brain cortical membrane
Bioorg Med Chem 17: 2842-51 (2009)
Article DOI: 10.1016/j.bmc.2009.02.027
BindingDB Entry DOI: 10.7270/Q23R0TSC
G-protein coupled receptor 55
(Homo sapiens (Human))
BDBM50278328
(3-Benzyl-6-iodochromen-2-one | CHEMBL443168)
Show SMILES Ic1ccc2oc(=O)c(Cc3ccccc3)cc2c1
Show InChI InChI=1S/C16H11IO2/c17-14-6-7-15-12(10-14)9-13(16(18)19-15)8-11-4-2-1-3-5-11/h1-7,9-10H,8H2
Reactome pathway
n/an/a>1.00E+4n/an/an/an/an/an/a
University of Bonn
Curated by ChEMBL
Assay Description
Antagonist activity at human GPR55 transfected in CHO cells assessed as inhibition of LPI-induced beta-arrestin recruitment incubated 60 mins prior t...
J Med Chem 56: 4798-810 (2013)
Article DOI: 10.1021/jm4005175
BindingDB Entry DOI: 10.7270/Q2GM88QX