BDBM50278376 CHEMBL471455::methyl 3-(2-amino-5-(thiophen-2-yl)phenylcarbamoyl)benzyl(phenyl)phosphinate
SMILES: COP(=O)(Cc1cccc(c1)C(=O)Nc1cc(ccc1N)-c1cccs1)c1ccccc1
InChI Key: InChIKey=YESYBBLVBUYLNF-UHFFFAOYSA-N
Data: 1 IC50
Activity Spreadsheet -- Enzyme Inhibition Constant Data from BindingDB
Found 1 hit for monomerid = 50278376
Trg + Lig
Ki
nM
ΔG°
kcal/mole
IC50
nM
Kd
nM
EC50/IC50
nM
koff
s-1
kon
M-1s-1
pHTemp
°C
Histone deacetylase 1
(Homo sapiens (Human))
BDBM50278376
(CHEMBL471455 | methyl 3-(2-amino-5-(thiophen-2-yl)...)
Show SMILES COP(=O)(Cc1cccc(c1)C(=O)Nc1cc(ccc1N)-c1cccs1)c1ccccc1
Show InChI InChI=1S/C25H23N2O3PS/c1-30-31(29,21-9-3-2-4-10-21)17-18-7-5-8-20(15-18)25(28)27-23-16-19(12-13-22(23)26)24-11-6-14-32-24/h2-16H,17,26H2,1H3,(H,27,28)
NCI pathway
Reactome pathway
n/an/a 140n/an/an/an/an/an/a
Merck Research Laboratories
Curated by ChEMBL
Assay Description
Inhibition of HDAC1
Bioorg Med Chem Lett 19: 2053-8 (2009)
Article DOI: 10.1016/j.bmcl.2009.02.009
BindingDB Entry DOI: 10.7270/Q2QV3MDQ