BDBM50278435 CHEMBL512665::N-butyl-N-(piperidin-4-yl)naphthalene-2-sulfonamide
SMILES: CCCCN(C1CCNCC1)S(=O)(=O)c1ccc2ccccc2c1
InChI Key: InChIKey=BGQYUSCFJWWBHR-UHFFFAOYSA-N
Data: 1 KI  3 IC50
Activity Spreadsheet -- Enzyme Inhibition Constant Data from BindingDB
Found 4 hits for monomerid = 50278435
Trg + Lig
Ki
nM
ΔG°
kcal/mole
IC50
nM
Kd
nM
EC50/IC50
nM
koff
s-1
kon
M-1s-1
pHTemp
°C
Potassium voltage-gated channel subfamily H member 2
(Homo sapiens (Human))
BDBM50278435
(CHEMBL512665 | N-butyl-N-(piperidin-4-yl)naphthale...)
Show SMILES CCCCN(C1CCNCC1)S(=O)(=O)c1ccc2ccccc2c1
Show InChI InChI=1S/C19H26N2O2S/c1-2-3-14-21(18-10-12-20-13-11-18)24(22,23)19-9-8-16-6-4-5-7-17(16)15-19/h4-9,15,18,20H,2-3,10-14H2,1H3
Reactome pathway
716n/an/an/an/an/an/an/an/a
Pfizer Global Research and Development
Curated by ChEMBL
Assay Description
Displacement of [3H]dofetilide from human ERG expressed in HEK293 cells
Bioorg Med Chem Lett 19: 2329-32 (2009)
Article DOI: 10.1016/j.bmcl.2009.02.054
BindingDB Entry DOI: 10.7270/Q2251J39
Sodium-dependent dopamine transporter
(Homo sapiens (Human))
BDBM50278435
(CHEMBL512665 | N-butyl-N-(piperidin-4-yl)naphthale...)
Show SMILES CCCCN(C1CCNCC1)S(=O)(=O)c1ccc2ccccc2c1
Show InChI InChI=1S/C19H26N2O2S/c1-2-3-14-21(18-10-12-20-13-11-18)24(22,23)19-9-8-16-6-4-5-7-17(16)15-19/h4-9,15,18,20H,2-3,10-14H2,1H3
NCI pathway
Reactome pathway
n/an/a 1.90E+4n/an/an/an/an/an/a
Pfizer Global Research and Development
Curated by ChEMBL
Assay Description
Inhibition of radiolabeled dopamine reuptake at human DAT expressed in HEK293 cells
Bioorg Med Chem Lett 19: 2329-32 (2009)
Article DOI: 10.1016/j.bmcl.2009.02.054
BindingDB Entry DOI: 10.7270/Q2251J39
Sodium-dependent serotonin transporter
(Homo sapiens (Human))
BDBM50278435
(CHEMBL512665 | N-butyl-N-(piperidin-4-yl)naphthale...)
Show SMILES CCCCN(C1CCNCC1)S(=O)(=O)c1ccc2ccccc2c1
Show InChI InChI=1S/C19H26N2O2S/c1-2-3-14-21(18-10-12-20-13-11-18)24(22,23)19-9-8-16-6-4-5-7-17(16)15-19/h4-9,15,18,20H,2-3,10-14H2,1H3
n/an/a 14n/an/an/an/an/an/a
Pfizer Global Research and Development
Curated by ChEMBL
Assay Description
Inhibition of radiolabeled serotonin reuptake at human SERT expressed in HEK293 cells
Bioorg Med Chem Lett 19: 2329-32 (2009)
Article DOI: 10.1016/j.bmcl.2009.02.054
BindingDB Entry DOI: 10.7270/Q2251J39
Sodium-dependent noradrenaline transporter
(Homo sapiens (Human))
BDBM50278435
(CHEMBL512665 | N-butyl-N-(piperidin-4-yl)naphthale...)
Show SMILES CCCCN(C1CCNCC1)S(=O)(=O)c1ccc2ccccc2c1
Show InChI InChI=1S/C19H26N2O2S/c1-2-3-14-21(18-10-12-20-13-11-18)24(22,23)19-9-8-16-6-4-5-7-17(16)15-19/h4-9,15,18,20H,2-3,10-14H2,1H3
Reactome pathway
n/an/a 4.00E+4n/an/an/an/an/an/a
Pfizer Global Research and Development
Curated by ChEMBL
Assay Description
Inhibition of radiolabeled noradrenaline reuptake at human NET expressed in HEK293 cells
Bioorg Med Chem Lett 19: 2329-32 (2009)
Article DOI: 10.1016/j.bmcl.2009.02.054
BindingDB Entry DOI: 10.7270/Q2251J39