BDBM50278526 4-((naphthalen-2-yloxy)methyl)piperidine::CHEMBL453996
SMILES: C(Oc1ccc2ccccc2c1)C1CCNCC1
InChI Key: InChIKey=MUOXAGUZMVATIC-UHFFFAOYSA-N
Data: 2 KI  3 IC50
Activity Spreadsheet -- Enzyme Inhibition Constant Data from BindingDB
Found 5 hits for monomerid = 50278526
Trg + Lig
Ki
nM
ΔG°
kcal/mole
IC50
nM
Kd
nM
EC50/IC50
nM
koff
s-1
kon
M-1s-1
pHTemp
°C
5-hydroxytryptamine receptor 3A
(Homo sapiens (Human))
BDBM50278526
(4-((naphthalen-2-yloxy)methyl)piperidine | CHEMBL4...)
Show SMILES C(Oc1ccc2ccccc2c1)C1CCNCC1
Show InChI InChI=1S/C16H19NO/c1-2-4-15-11-16(6-5-14(15)3-1)18-12-13-7-9-17-10-8-13/h1-6,11,13,17H,7-10,12H2
Reactome pathway
311n/an/an/an/an/an/an/an/a
Pfizer Global Research and Development
Curated by ChEMBL
Assay Description
Displacement of [3H]granisetron from human 5HT3 receptor expressed in HEK293 cells
Bioorg Med Chem Lett 19: 2329-32 (2009)
Article DOI: 10.1016/j.bmcl.2009.02.054
BindingDB Entry DOI: 10.7270/Q2251J39
Potassium voltage-gated channel subfamily H member 2
(Homo sapiens (Human))
BDBM50278526
(4-((naphthalen-2-yloxy)methyl)piperidine | CHEMBL4...)
Show SMILES C(Oc1ccc2ccccc2c1)C1CCNCC1
Show InChI InChI=1S/C16H19NO/c1-2-4-15-11-16(6-5-14(15)3-1)18-12-13-7-9-17-10-8-13/h1-6,11,13,17H,7-10,12H2
Reactome pathway
3.80E+3n/an/an/an/an/an/an/an/a
Pfizer Global Research and Development
Curated by ChEMBL
Assay Description
Displacement of [3H]dofetilide from human ERG expressed in HEK293 cells
Bioorg Med Chem Lett 19: 2329-32 (2009)
Article DOI: 10.1016/j.bmcl.2009.02.054
BindingDB Entry DOI: 10.7270/Q2251J39
Sodium-dependent dopamine transporter
(Homo sapiens (Human))
BDBM50278526
(4-((naphthalen-2-yloxy)methyl)piperidine | CHEMBL4...)
Show SMILES C(Oc1ccc2ccccc2c1)C1CCNCC1
Show InChI InChI=1S/C16H19NO/c1-2-4-15-11-16(6-5-14(15)3-1)18-12-13-7-9-17-10-8-13/h1-6,11,13,17H,7-10,12H2
NCI pathway
Reactome pathway
n/an/a>7.00E+3n/an/an/an/an/an/a
Pfizer Global Research and Development
Curated by ChEMBL
Assay Description
Inhibition of radiolabeled dopamine reuptake at human DAT expressed in HEK293 cells
Bioorg Med Chem Lett 19: 2329-32 (2009)
Article DOI: 10.1016/j.bmcl.2009.02.054
BindingDB Entry DOI: 10.7270/Q2251J39
Sodium-dependent serotonin transporter
(Homo sapiens (Human))
BDBM50278526
(4-((naphthalen-2-yloxy)methyl)piperidine | CHEMBL4...)
Show SMILES C(Oc1ccc2ccccc2c1)C1CCNCC1
Show InChI InChI=1S/C16H19NO/c1-2-4-15-11-16(6-5-14(15)3-1)18-12-13-7-9-17-10-8-13/h1-6,11,13,17H,7-10,12H2
n/an/a 8n/an/an/an/an/an/a
Pfizer Global Research and Development
Curated by ChEMBL
Assay Description
Inhibition of radiolabeled serotonin reuptake at human SERT expressed in HEK293 cells
Bioorg Med Chem Lett 19: 2329-32 (2009)
Article DOI: 10.1016/j.bmcl.2009.02.054
BindingDB Entry DOI: 10.7270/Q2251J39
Sodium-dependent noradrenaline transporter
(Homo sapiens (Human))
BDBM50278526
(4-((naphthalen-2-yloxy)methyl)piperidine | CHEMBL4...)
Show SMILES C(Oc1ccc2ccccc2c1)C1CCNCC1
Show InChI InChI=1S/C16H19NO/c1-2-4-15-11-16(6-5-14(15)3-1)18-12-13-7-9-17-10-8-13/h1-6,11,13,17H,7-10,12H2
Reactome pathway
n/an/a 1.80E+3n/an/an/an/an/an/a
Pfizer Global Research and Development
Curated by ChEMBL
Assay Description
Inhibition of radiolabeled noradrenaline reuptake at human NET expressed in HEK293 cells
Bioorg Med Chem Lett 19: 2329-32 (2009)
Article DOI: 10.1016/j.bmcl.2009.02.054
BindingDB Entry DOI: 10.7270/Q2251J39