BDBM50278646 CHEMBL470409::N-(2-aminoethyl)-4-bromo-5-(1H-pyrrolo[2,3-b]pyridin-4-yl)thiophene-2-carboxamide
SMILES: NCCNC(=O)c1cc(Br)c(s1)-c1ccnc2[nH]ccc12
InChI Key: InChIKey=JWMDMQGOJLNOPE-UHFFFAOYSA-N
Data: 1 IC50
Activity Spreadsheet -- Enzyme Inhibition Constant Data from BindingDB
Found 1 hit for monomerid = 50278646
Trg + Lig
Ki
nM
ΔG°
kcal/mole
IC50
nM
Kd
nM
EC50/IC50
nM
koff
s-1
kon
M-1s-1
pHTemp
°C
RAC-alpha serine/threonine-protein kinase
(Homo sapiens (Human))
BDBM50278646
(CHEMBL470409 | N-(2-aminoethyl)-4-bromo-5-(1H-pyrr...)
Show SMILES NCCNC(=O)c1cc(Br)c(s1)-c1ccnc2[nH]ccc12
Show InChI InChI=1S/C14H13BrN4OS/c15-10-7-11(14(20)19-6-3-16)21-12(10)8-1-4-17-13-9(8)2-5-18-13/h1-2,4-5,7H,3,6,16H2,(H,17,18)(H,19,20)
n/an/a 158n/an/an/an/an/an/a
GlaxoSmithKline
Curated by ChEMBL
Assay Description
Inhibition of AKT1
Bioorg Med Chem Lett 19: 2244-8 (2009)
Article DOI: 10.1016/j.bmcl.2009.02.094
BindingDB Entry DOI: 10.7270/Q24X57PX