null
SMILES: Oc1ccc(cc1)-c1ccc(CN=O)c(F)c1
InChI Key: InChIKey=WYUXZEOYVNCHMC-UHFFFAOYSA-N
Activity Spreadsheet -- Enzyme Inhibition Constant Data from BindingDB
Found 2 hits for monomerid = 50278885
Trg + Lig
Ki
nM
ΔG°
kcal/mole
IC50
nM
Kd
nM
EC50/IC50
nM
koff
s-1
kon
M-1s-1
pHTemp
°C
Estrogen receptor beta
(Homo sapiens (Human))
BDBM50278885
(3-Fluoro-4'-hydroxy-1,1'-biphenyl-4-carbaldehyde o...)
Show SMILES Oc1ccc(cc1)-c1ccc(CN=O)c(F)c1
Show InChI InChI=1S/C13H10FNO2/c14-13-7-10(1-2-11(13)8-15-17)9-3-5-12(16)6-4-9/h1-7,16H,8H2
n/an/a 32.3n/an/an/an/an/an/a
University of Pittsburgh
Curated by ChEMBL
Assay Description
Displacement of fluorescein-labeled estradiol from human recombinant ERbeta by fluorescence polarization assay
Bioorg Med Chem Lett 19: 2404-8 (2009)
Article DOI: 10.1016/j.bmcl.2009.03.075
BindingDB Entry DOI: 10.7270/Q26D5SWP
Estrogen receptor
(Homo sapiens (Human))
BDBM50278885
(3-Fluoro-4'-hydroxy-1,1'-biphenyl-4-carbaldehyde o...)
Show SMILES Oc1ccc(cc1)-c1ccc(CN=O)c(F)c1
Show InChI InChI=1S/C13H10FNO2/c14-13-7-10(1-2-11(13)8-15-17)9-3-5-12(16)6-4-9/h1-7,16H,8H2
n/an/a 795n/an/an/an/an/an/a
University of Pittsburgh
Curated by ChEMBL
Assay Description
Displacement of fluorescein-labeled estradiol from human recombinant ERalpha by fluorescence polarization assay
Bioorg Med Chem Lett 19: 2404-8 (2009)
Article DOI: 10.1016/j.bmcl.2009.03.075
BindingDB Entry DOI: 10.7270/Q26D5SWP