null
SMILES: O=C(C1CCC1)C1N(C(=O)c2ccco2)c2ccccc2-c2ccccc12
InChI Key: InChIKey=NHGDWURBLGPZPM-UHFFFAOYSA-N
Activity Spreadsheet -- Enzyme Inhibition Constant Data from BindingDB
Found 1 hit for monomerid = 50278939
Trg + Lig
Ki
nM
ΔG°
kcal/mole
IC50
nM
Kd
nM
EC50/IC50
nM
koff
s-1
kon
M-1s-1
pHTemp
°C
Potassium voltage-gated channel subfamily A member 3
(Homo sapiens (Human))
BDBM50278939
((6-(cyclobutanecarbonyl)phenanthridin-5(6H)-yl)(fu...)
Show SMILES O=C(C1CCC1)C1N(C(=O)c2ccco2)c2ccccc2-c2ccccc12
Show InChI InChI=1S/C23H19NO3/c25-22(15-7-5-8-15)21-18-11-2-1-9-16(18)17-10-3-4-12-19(17)24(21)23(26)20-13-6-14-27-20/h1-4,6,9-15,21H,5,7-8H2
Reactome pathway
n/an/a 4.20E+3n/an/an/an/an/an/a
4SC AG
Curated by ChEMBL
Assay Description
Inhibition of cloned Kv1.3 channel (unknown origin) expressed in mammalian cells by whole cell patch clamp assay
Bioorg Med Chem Lett 19: 2299-304 (2009)
Article DOI: 10.1016/j.bmcl.2009.02.077
BindingDB Entry DOI: 10.7270/Q29K4B38