null
SMILES: O=C(C1N(C(=O)c2ccco2)c2ccccc2-c2ccccc12)c1ccco1
InChI Key: InChIKey=LJSXUNFLSHJCEQ-UHFFFAOYSA-N
Activity Spreadsheet -- Enzyme Inhibition Constant Data from BindingDB
Found 1 hit for monomerid = 50278994
Trg + Lig
Ki
nM
ΔG°
kcal/mole
IC50
nM
Kd
nM
EC50/IC50
nM
koff
s-1
kon
M-1s-1
pHTemp
°C
Potassium voltage-gated channel subfamily A member 3
(Homo sapiens (Human))
BDBM50278994
(CHEMBL498728 | phenanthridine-5,6(6H)-diylbis(fura...)
Show SMILES O=C(C1N(C(=O)c2ccco2)c2ccccc2-c2ccccc12)c1ccco1
Show InChI InChI=1S/C23H15NO4/c25-22(19-11-5-13-27-19)21-17-9-2-1-7-15(17)16-8-3-4-10-18(16)24(21)23(26)20-12-6-14-28-20/h1-14,21H
Reactome pathway
n/an/a 1.50E+3n/an/an/an/an/an/a
4SC AG
Curated by ChEMBL
Assay Description
Inhibition of cloned Kv1.3 channel (unknown origin) expressed in mammalian cells by whole cell patch clamp assay
Bioorg Med Chem Lett 19: 2299-304 (2009)
Article DOI: 10.1016/j.bmcl.2009.02.077
BindingDB Entry DOI: 10.7270/Q29K4B38