BDBM50279047 1-Butyl-2-[5-(4-chloro-phenyl)-1-(2,4-dichloro-phenyl)-4-methyl-1H-pyrazol-3-yl]-5,5-dimethyl-1,5-dihydro-imidazol-4one::CHEMBL499076
SMILES: CCCCN1C(=NC(=O)C1(C)C)c1nn(c(c1C)-c1ccc(Cl)cc1)-c1ccc(Cl)cc1Cl
InChI Key: InChIKey=JNFLGYVGKKWDGH-UHFFFAOYSA-N
Data: 2 IC50
Activity Spreadsheet -- Enzyme Inhibition Constant Data from BindingDB
Found 2 hits for monomerid = 50279047
Trg + Lig
Ki
nM
ΔG°
kcal/mole
IC50
nM
Kd
nM
EC50/IC50
nM
koff
s-1
kon
M-1s-1
pHTemp
°C
Cannabinoid receptor 2
(Homo sapiens (Human))
BDBM50279047
(1-Butyl-2-[5-(4-chloro-phenyl)-1-(2,4-dichloro-phe...)
Show SMILES CCCCN1C(=NC(=O)C1(C)C)c1nn(c(c1C)-c1ccc(Cl)cc1)-c1ccc(Cl)cc1Cl |c:5|
Show InChI InChI=1S/C25H25Cl3N4O/c1-5-6-13-31-23(29-24(33)25(31,3)4)21-15(2)22(16-7-9-17(26)10-8-16)32(30-21)20-12-11-18(27)14-19(20)28/h7-12,14H,5-6,13H2,1-4H3
Reactome pathway
n/an/a 4.76E+3n/an/an/an/an/an/a
National Health Research Institutes
Curated by ChEMBL
Assay Description
Displacement of [3H]CP55940 from human recombinant CB2R expressed in HEK293 cells
J Med Chem 52: 4496-510 (2009)
Article DOI: 10.1021/jm900471u
BindingDB Entry DOI: 10.7270/Q26W99Z4
Cannabinoid receptor 1
(Homo sapiens (Human))
BDBM50279047
(1-Butyl-2-[5-(4-chloro-phenyl)-1-(2,4-dichloro-phe...)
Show SMILES CCCCN1C(=NC(=O)C1(C)C)c1nn(c(c1C)-c1ccc(Cl)cc1)-c1ccc(Cl)cc1Cl |c:5|
Show InChI InChI=1S/C25H25Cl3N4O/c1-5-6-13-31-23(29-24(33)25(31,3)4)21-15(2)22(16-7-9-17(26)10-8-16)32(30-21)20-12-11-18(27)14-19(20)28/h7-12,14H,5-6,13H2,1-4H3
NCI pathway
Reactome pathway
n/an/a 1.11E+3n/an/an/an/an/an/a
National Health Research Institutes
Curated by ChEMBL
Assay Description
Displacement of [3H]CP55940 from human recombinant CB1R expressed in HEK293 cells
J Med Chem 52: 4496-510 (2009)
Article DOI: 10.1021/jm900471u
BindingDB Entry DOI: 10.7270/Q26W99Z4