null
SMILES: COc1ccc2OCCC(=Nn3cc(O)n(CCCN4CCN(C)CC4)c3=O)c2c1
InChI Key: InChIKey=LAKAUYDBSZPPPF-UHFFFAOYSA-N
Activity Spreadsheet -- Enzyme Inhibition Constant Data from BindingDB
Found 2 hits for monomerid = 50279436
Trg + Lig
Ki
nM
ΔG°
kcal/mole
IC50
nM
Kd
nM
EC50/IC50
nM
koff
s-1
kon
M-1s-1
pHTemp
°C
Potassium voltage-gated channel subfamily KQT member 1
(Cavia porcellus)
BDBM50279436
(1-(2,3-dihydro-6-methoxychromen-4-ylideneamino)-3-...)
Show SMILES COc1ccc2OCCC(=Nn3cc(O)n(CCCN4CCN(C)CC4)c3=O)c2c1 |w:10.10|
Show InChI InChI=1S/C21H29N5O4/c1-23-9-11-24(12-10-23)7-3-8-25-20(27)15-26(21(25)28)22-18-6-13-30-19-5-4-16(29-2)14-17(18)19/h4-5,14-15,27H,3,6-13H2,1-2H3
n/an/a 1.90n/an/an/an/an/an/a
China Pharmaceutical University
Curated by ChEMBL
Assay Description
Inhibition of KVLQT1/minK in guinea pig ventricular myocytes assessed as blockade of slow delayed rectifier potassium current by whole cell patch-cla...
Bioorg Med Chem Lett 19: 1477-80 (2009)
Article DOI: 10.1016/j.bmcl.2009.01.022
BindingDB Entry DOI: 10.7270/Q22J6BQK
Potassium voltage-gated channel subfamily H member 2
(Cavia porcellus)
BDBM50279436
(1-(2,3-dihydro-6-methoxychromen-4-ylideneamino)-3-...)
Show SMILES COc1ccc2OCCC(=Nn3cc(O)n(CCCN4CCN(C)CC4)c3=O)c2c1 |w:10.10|
Show InChI InChI=1S/C21H29N5O4/c1-23-9-11-24(12-10-23)7-3-8-25-20(27)15-26(21(25)28)22-18-6-13-30-19-5-4-16(29-2)14-17(18)19/h4-5,14-15,27H,3,6-13H2,1-2H3
n/an/a 540n/an/an/an/an/an/a
China Pharmaceutical University
Curated by ChEMBL
Assay Description
Inhibition of ERG in guinea pig ventricular myocytes assessed as blockade of rapid delayed rectifier potassium current by whole cell patch-clamp tech...
Bioorg Med Chem Lett 19: 1477-80 (2009)
Article DOI: 10.1016/j.bmcl.2009.01.022
BindingDB Entry DOI: 10.7270/Q22J6BQK