BDBM50279536 6-(4-(1H-imidazol-1-yl)-4-oxobutyl)-4-(2,6-dichlorophenyl)-9-hydroxypyrrolo[3,4-c]carbazole-1,3(2H,6H)-dione::CHEMBL483786
SMILES: Oc1ccc2n(CCCC(=O)n3ccnc3)c3cc(c4C(=O)NC(=O)c4c3c2c1)-c1c(Cl)cccc1Cl
InChI Key: InChIKey=XLCHKSGXVNHTKZ-UHFFFAOYSA-N
Data: 1 IC50
Activity Spreadsheet -- Enzyme Inhibition Constant Data from BindingDB
Found 1 hit for monomerid = 50279536
Trg + Lig
Ki
nM
ΔG°
kcal/mole
IC50
nM
Kd
nM
EC50/IC50
nM
koff
s-1
kon
M-1s-1
pHTemp
°C
Serine/threonine-protein kinase WEE1
(Homo sapiens (Human))
BDBM50279536
(6-(4-(1H-imidazol-1-yl)-4-oxobutyl)-4-(2,6-dichlor...)
Show SMILES Oc1ccc2n(CCCC(=O)n3ccnc3)c3cc(c4C(=O)NC(=O)c4c3c2c1)-c1c(Cl)cccc1Cl |(5.42,-7.62,;6.62,-8.58,;6.38,-10.11,;7.59,-11.07,;9.02,-10.51,;10.4,-11.21,;10.47,-12.75,;11.83,-13.46,;11.89,-15,;13.25,-15.72,;14.56,-14.9,;13.32,-17.26,;12.12,-18.21,;12.65,-19.66,;14.19,-19.6,;14.61,-18.11,;11.54,-10.18,;13.08,-10.21,;13.89,-8.88,;13.12,-7.53,;13.63,-6.08,;15.1,-5.63,;12.4,-5.15,;11.14,-6.03,;9.69,-5.52,;11.59,-7.5,;10.79,-8.82,;9.25,-8.98,;8.05,-8.02,;15.42,-8.9,;16.17,-10.25,;15.37,-11.57,;17.7,-10.27,;18.5,-8.95,;17.74,-7.6,;16.2,-7.58,;15.45,-6.24,)|
Show InChI InChI=1S/C27H18Cl2N4O4/c28-17-3-1-4-18(29)22(17)16-12-20-23(25-24(16)26(36)31-27(25)37)15-11-14(34)6-7-19(15)33(20)9-2-5-21(35)32-10-8-30-13-32/h1,3-4,6-8,10-13,34H,2,5,9H2,(H,31,36,37)
NCI pathway
Reactome pathway
n/an/a 59n/an/an/an/an/an/a
Chulalongkorn University
Curated by ChEMBL
Assay Description
Inhibition of human Wee1
Eur J Med Chem 44: 1383-95 (2009)
Article DOI: 10.1016/j.ejmech.2008.09.027
BindingDB Entry DOI: 10.7270/Q2X34XB6